{"text_format":"3","workbook":"xlsx","n_sheets":5,"sheets":["Startseite","Eingaben","Stammdaten","Hilfe","Parameter_Intern"],"not_rendered":{"images":3,"macros":1,"defined_names":16,"comments":1},"read":"whole","date_system":"1900"}

{"sheet":"Startseite","index":0,"n_rows":41,"n_cols":14,"rows_kept":41,"merged":[[10,6,14,7],[11,12,11,13],[16,3,16,4]]}
[]
[]
[]
[{"$nulls":9},"Startseite"]
[null,"Bewirtungskosten abrechnen"]
[]
[]
[]
[{"$nulls":3},"Tabellenblätter",{"$nulls":8},"Tabellenblatt",1]
[{"$nulls":6},"Info"]
[{"$nulls":6},{"$f":"INDEX(Parameter_Intern!C5:D7,Startseite!N9,2)","v":"Hier können Sie die Stammdaten eingeben"},{"$nulls":5},{"$f":"+N9/2","v":0.5},{"$f":"+ROUND(N9/2,0)","v":1}]
[{"$nulls":12},{"$f":"IF(M11=N11,1,2)","v":2}]
[]
[]
[]
[]
[{"$nulls":3},{"$f":"\"Bei einem Klick auf \"&H17&\" kommen Sie direkt zum entsprechenden Arbeitsblatt\"","v":"Bei einem Klick auf Stammdaten kommen Sie direkt zum entsprechenden Arbeitsblatt"},{"$nulls":3},{"$f":"+HYPERLINK(VLOOKUP($N$9,Parameter_Intern!$B$5:$E$30,4,FALSE),VLOOKUP($N$9,Parameter_Intern!$B$5:$E$30,2,FALSE))","v":"Stammdaten"}]
{"$rows_empty":21}
[null,"© 2022 by mediaforwork - ein Unternehmensbereich der Verlag für die Deutsche Wirtschaft AG"]
[null,"Die Vervielfältigung, Verbreitung oder Veräußerung der Daten oder Texte ist unzulässig und"]
[null,"ausdrücklich nur mit Genehmigung des Verlags gestattet."]

{"sheet":"Eingaben","index":1,"n_rows":51,"n_cols":27,"rows_kept":51,"merged":[[2,1,2,12],[3,1,3,12],[5,5,5,6],[7,5,8,10],[10,5,10,6],[13,3,13,10],[14,3,14,10],[15,3,15,10],[16,3,16,10],[17,3,17,10],[18,3,18,10],[19,3,19,10],[22,3,22,10],[23,3,23,10],[24,3,24,10],[25,3,25,10],[26,3,26,10],[27,3,27,10],[28,3,28,10],[38,3,38,4],[42,3,42,4],[42,6,42,9],[46,1,46,3],[46,6,46,7]]}
[]
[{"$nulls":12},"Abrechnung von Bewirtungskosten"]
[null,"Abrechnung von Bewirtungskosten"]
[null,{"$f":"\"Firma \"&Stammdaten!V8&\", \"&Stammdaten!V9&\", \"&Stammdaten!V10&\" \"&Stammdaten!V11","v":"Firma Müller GmbH, Meierstraße 11, 47111 Ortschaft"}]
[{"$nulls":16},"Datum 1",{"$f":"+TODAY()-100","v":"2023-01-15"}]
[{"$nulls":3},"Datum der Bewirtung:",null,"2022-01-03",{"$nulls":10},"Datum 2",{"$f":"+TODAY()+100","v":"2023-08-03"}]
[]
[{"$nulls":3},"Ort der Bewirtung:",null,"Gasthaus zum Goldenen Hirsch"]
[]
[]
[{"$nulls":3},"Mitarbeiter:",null,"Müller, Heinz",null,null,{"$f":"IF(ISERROR(IF(F11=\"\",\"\",\"KST: \"&VLOOKUP(F11,V12:W47,2,FALSE))),\"\",IF(F11=\"\",\"\",\"KST: \"&VLOOKUP(F11,V12:W47,2,FALSE)))","v":"KST: 4711"},{"$nulls":5},{"$f":"+IF(F11=\"\",\"Mitarbeiter wählen\",\"\")","v":""}]
[{"$nulls":16},1,{"$f":"+VLOOKUP($Q$12,Stammdaten!$L$9:$P$34,3,FALSE)","v":"Zum vollen Krug"},{"$f":"+VLOOKUP($Q$12,Stammdaten!$L$9:$P$34,4,FALSE)","v":"Musterstraße 3"},{"$f":"+VLOOKUP($Q$12,Stammdaten!$L$9:$P$34,5,FALSE)","v":"47111 Musterstadt"},null,{"$f":"IF(Stammdaten!C9=\"\",\"\",Stammdaten!C9)","v":"Müller, Heinz"},{"$f":"IF(Stammdaten!D9=\"\",\"\",Stammdaten!D9)","v":{"v":4711,"d":"4711.00"}},{"$f":"IF(Stammdaten!E9=\"\",\"\",Stammdaten!E9)","v":"Walkes-Bank"},{"$f":"IF(Stammdaten!F9=\"\",\"\",Stammdaten!F9)","v":"0047114711"},{"$f":"IF(Stammdaten!G9=\"\",\"\",Stammdaten!G9)","v":"124578963"},{"$f":"IF(Stammdaten!H9=\"\",\"\",Stammdaten!H9)","v":""}]
[{"$nulls":3},"Bewirtete Personen:",{"$nulls":17},{"$f":"IF(Stammdaten!C10=\"\",\"\",Stammdaten!C10)","v":"Schmitz, Dieter"},{"$f":"IF(Stammdaten!D10=\"\",\"\",Stammdaten!D10)","v":{"v":4712,"d":"4712.00"}},{"$f":"IF(Stammdaten!E10=\"\",\"\",Stammdaten!E10)","v":"Walkes-Sparkasse"},{"$f":"IF(Stammdaten!F10=\"\",\"\",Stammdaten!F10)","v":"123465678"},{"$f":"IF(Stammdaten!G10=\"\",\"\",Stammdaten!G10)","v":"1254896"},{"$f":"IF(Stammdaten!H10=\"\",\"\",Stammdaten!H10)","v":""}]
[{"$nulls":21},{"$f":"IF(Stammdaten!C11=\"\",\"\",Stammdaten!C11)","v":"Schulz, Harald"},{"$f":"IF(Stammdaten!D11=\"\",\"\",Stammdaten!D11)","v":{"v":4713,"d":"4713.00"}},{"$f":"IF(Stammdaten!E11=\"\",\"\",Stammdaten!E11)","v":"Walkes-Dreba"},{"$f":"IF(Stammdaten!F11=\"\",\"\",Stammdaten!F11)","v":"987654"},{"$f":"IF(Stammdaten!G11=\"\",\"\",Stammdaten!G11)","v":"0006659985"},{"$f":"IF(Stammdaten!H11=\"\",\"\",Stammdaten!H11)","v":""}]
[{"$nulls":21},{"$f":"IF(Stammdaten!C12=\"\",\"\",Stammdaten!C12)","v":""},{"$f":"IF(Stammdaten!D12=\"\",\"\",Stammdaten!D12)","v":""},{"$f":"IF(Stammdaten!E12=\"\",\"\",Stammdaten!E12)","v":""},{"$f":"IF(Stammdaten!F12=\"\",\"\",Stammdaten!F12)","v":""},{"$f":"IF(Stammdaten!G12=\"\",\"\",Stammdaten!G12)","v":""},{"$f":"IF(Stammdaten!H12=\"\",\"\",Stammdaten!H12)","v":""}]
[{"$nulls":21},{"$f":"IF(Stammdaten!C13=\"\",\"\",Stammdaten!C13)","v":""},{"$f":"IF(Stammdaten!D13=\"\",\"\",Stammdaten!D13)","v":""},{"$f":"IF(Stammdaten!E13=\"\",\"\",Stammdaten!E13)","v":""},{"$f":"IF(Stammdaten!F13=\"\",\"\",Stammdaten!F13)","v":""},{"$f":"IF(Stammdaten!G13=\"\",\"\",Stammdaten!G13)","v":""},{"$f":"IF(Stammdaten!H13=\"\",\"\",Stammdaten!H13)","v":""}]
[{"$nulls":21},{"$f":"IF(Stammdaten!C14=\"\",\"\",Stammdaten!C14)","v":""},{"$f":"IF(Stammdaten!D14=\"\",\"\",Stammdaten!D14)","v":""},{"$f":"IF(Stammdaten!E14=\"\",\"\",Stammdaten!E14)","v":""},{"$f":"IF(Stammdaten!F14=\"\",\"\",Stammdaten!F14)","v":""},{"$f":"IF(Stammdaten!G14=\"\",\"\",Stammdaten!G14)","v":""},{"$f":"IF(Stammdaten!H14=\"\",\"\",Stammdaten!H14)","v":""}]
[{"$nulls":21},{"$f":"IF(Stammdaten!C15=\"\",\"\",Stammdaten!C15)","v":""},{"$f":"IF(Stammdaten!D15=\"\",\"\",Stammdaten!D15)","v":""},{"$f":"IF(Stammdaten!E15=\"\",\"\",Stammdaten!E15)","v":""},{"$f":"IF(Stammdaten!F15=\"\",\"\",Stammdaten!F15)","v":""},{"$f":"IF(Stammdaten!G15=\"\",\"\",Stammdaten!G15)","v":""},{"$f":"IF(Stammdaten!H15=\"\",\"\",Stammdaten!H15)","v":""}]
[{"$nulls":21},{"$f":"IF(Stammdaten!C16=\"\",\"\",Stammdaten!C16)","v":""},{"$f":"IF(Stammdaten!D16=\"\",\"\",Stammdaten!D16)","v":""},{"$f":"IF(Stammdaten!E16=\"\",\"\",Stammdaten!E16)","v":""},{"$f":"IF(Stammdaten!F16=\"\",\"\",Stammdaten!F16)","v":""},{"$f":"IF(Stammdaten!G16=\"\",\"\",Stammdaten!G16)","v":""},{"$f":"IF(Stammdaten!H16=\"\",\"\",Stammdaten!H16)","v":""}]
[{"$nulls":21},{"$f":"IF(Stammdaten!C17=\"\",\"\",Stammdaten!C17)","v":""},{"$f":"IF(Stammdaten!D17=\"\",\"\",Stammdaten!D17)","v":""},{"$f":"IF(Stammdaten!E17=\"\",\"\",Stammdaten!E17)","v":""},{"$f":"IF(Stammdaten!F17=\"\",\"\",Stammdaten!F17)","v":""},{"$f":"IF(Stammdaten!G17=\"\",\"\",Stammdaten!G17)","v":""},{"$f":"IF(Stammdaten!H17=\"\",\"\",Stammdaten!H17)","v":""}]
[{"$nulls":21},{"$f":"IF(Stammdaten!C18=\"\",\"\",Stammdaten!C18)","v":""},{"$f":"IF(Stammdaten!D18=\"\",\"\",Stammdaten!D18)","v":""},{"$f":"IF(Stammdaten!E18=\"\",\"\",Stammdaten!E18)","v":""},{"$f":"IF(Stammdaten!F18=\"\",\"\",Stammdaten!F18)","v":""},{"$f":"IF(Stammdaten!G18=\"\",\"\",Stammdaten!G18)","v":""},{"$f":"IF(Stammdaten!H18=\"\",\"\",Stammdaten!H18)","v":""}]
[{"$nulls":3},"Anlass der Bewirtung:",{"$nulls":17},{"$f":"IF(Stammdaten!C19=\"\",\"\",Stammdaten!C19)","v":""},{"$f":"IF(Stammdaten!D19=\"\",\"\",Stammdaten!D19)","v":""},{"$f":"IF(Stammdaten!E19=\"\",\"\",Stammdaten!E19)","v":""},{"$f":"IF(Stammdaten!F19=\"\",\"\",Stammdaten!F19)","v":""},{"$f":"IF(Stammdaten!G19=\"\",\"\",Stammdaten!G19)","v":""},{"$f":"IF(Stammdaten!H19=\"\",\"\",Stammdaten!H19)","v":""}]
[{"$nulls":21},{"$f":"IF(Stammdaten!C20=\"\",\"\",Stammdaten!C20)","v":""},{"$f":"IF(Stammdaten!D20=\"\",\"\",Stammdaten!D20)","v":""},{"$f":"IF(Stammdaten!E20=\"\",\"\",Stammdaten!E20)","v":""},{"$f":"IF(Stammdaten!F20=\"\",\"\",Stammdaten!F20)","v":""},{"$f":"IF(Stammdaten!G20=\"\",\"\",Stammdaten!G20)","v":""},{"$f":"IF(Stammdaten!H20=\"\",\"\",Stammdaten!H20)","v":""}]
[{"$nulls":21},{"$f":"IF(Stammdaten!C21=\"\",\"\",Stammdaten!C21)","v":""},{"$f":"IF(Stammdaten!D21=\"\",\"\",Stammdaten!D21)","v":""},{"$f":"IF(Stammdaten!E21=\"\",\"\",Stammdaten!E21)","v":""},{"$f":"IF(Stammdaten!F21=\"\",\"\",Stammdaten!F21)","v":""},{"$f":"IF(Stammdaten!G21=\"\",\"\",Stammdaten!G21)","v":""},{"$f":"IF(Stammdaten!H21=\"\",\"\",Stammdaten!H21)","v":""}]
[{"$nulls":21},{"$f":"IF(Stammdaten!C22=\"\",\"\",Stammdaten!C22)","v":""},{"$f":"IF(Stammdaten!D22=\"\",\"\",Stammdaten!D22)","v":""},{"$f":"IF(Stammdaten!E22=\"\",\"\",Stammdaten!E22)","v":""},{"$f":"IF(Stammdaten!F22=\"\",\"\",Stammdaten!F22)","v":""},{"$f":"IF(Stammdaten!G22=\"\",\"\",Stammdaten!G22)","v":""},{"$f":"IF(Stammdaten!H22=\"\",\"\",Stammdaten!H22)","v":""}]
[{"$nulls":21},{"$f":"IF(Stammdaten!C23=\"\",\"\",Stammdaten!C23)","v":""},{"$f":"IF(Stammdaten!D23=\"\",\"\",Stammdaten!D23)","v":""},{"$f":"IF(Stammdaten!E23=\"\",\"\",Stammdaten!E23)","v":""},{"$f":"IF(Stammdaten!F23=\"\",\"\",Stammdaten!F23)","v":""},{"$f":"IF(Stammdaten!G23=\"\",\"\",Stammdaten!G23)","v":""},{"$f":"IF(Stammdaten!H23=\"\",\"\",Stammdaten!H23)","v":""}]
[{"$nulls":21},{"$f":"IF(Stammdaten!C24=\"\",\"\",Stammdaten!C24)","v":""},{"$f":"IF(Stammdaten!D24=\"\",\"\",Stammdaten!D24)","v":""},{"$f":"IF(Stammdaten!E24=\"\",\"\",Stammdaten!E24)","v":""},{"$f":"IF(Stammdaten!F24=\"\",\"\",Stammdaten!F24)","v":""},{"$f":"IF(Stammdaten!G24=\"\",\"\",Stammdaten!G24)","v":""},{"$f":"IF(Stammdaten!H24=\"\",\"\",Stammdaten!H24)","v":""}]
[{"$nulls":21},{"$f":"IF(Stammdaten!C25=\"\",\"\",Stammdaten!C25)","v":""},{"$f":"IF(Stammdaten!D25=\"\",\"\",Stammdaten!D25)","v":""},{"$f":"IF(Stammdaten!E25=\"\",\"\",Stammdaten!E25)","v":""},{"$f":"IF(Stammdaten!F25=\"\",\"\",Stammdaten!F25)","v":""},{"$f":"IF(Stammdaten!G25=\"\",\"\",Stammdaten!G25)","v":""},{"$f":"IF(Stammdaten!H25=\"\",\"\",Stammdaten!H25)","v":""}]
[{"$nulls":16},{"v":1,"d":"1.00"},{"$nulls":4},{"$f":"IF(Stammdaten!C26=\"\",\"\",Stammdaten!C26)","v":""},{"$f":"IF(Stammdaten!D26=\"\",\"\",Stammdaten!D26)","v":""},{"$f":"IF(Stammdaten!E26=\"\",\"\",Stammdaten!E26)","v":""},{"$f":"IF(Stammdaten!F26=\"\",\"\",Stammdaten!F26)","v":""},{"$f":"IF(Stammdaten!G26=\"\",\"\",Stammdaten!G26)","v":""},{"$f":"IF(Stammdaten!H26=\"\",\"\",Stammdaten!H26)","v":""}]
[{"$nulls":21},{"$f":"IF(Stammdaten!C27=\"\",\"\",Stammdaten!C27)","v":""},{"$f":"IF(Stammdaten!D27=\"\",\"\",Stammdaten!D27)","v":""},{"$f":"IF(Stammdaten!E27=\"\",\"\",Stammdaten!E27)","v":""},{"$f":"IF(Stammdaten!F27=\"\",\"\",Stammdaten!F27)","v":""},{"$f":"IF(Stammdaten!G27=\"\",\"\",Stammdaten!G27)","v":""},{"$f":"IF(Stammdaten!H27=\"\",\"\",Stammdaten!H27)","v":""}]
[{"$nulls":3},"Höhe der Aufwendungen gemäß anliegender Rechnung(en)/Quittung(en):",{"$nulls":17},{"$f":"IF(Stammdaten!C28=\"\",\"\",Stammdaten!C28)","v":""},{"$f":"IF(Stammdaten!D28=\"\",\"\",Stammdaten!D28)","v":""},{"$f":"IF(Stammdaten!E28=\"\",\"\",Stammdaten!E28)","v":""},{"$f":"IF(Stammdaten!F28=\"\",\"\",Stammdaten!F28)","v":""},{"$f":"IF(Stammdaten!G28=\"\",\"\",Stammdaten!G28)","v":""},{"$f":"IF(Stammdaten!H28=\"\",\"\",Stammdaten!H28)","v":""}]
[{"$nulls":21},{"$f":"IF(Stammdaten!C29=\"\",\"\",Stammdaten!C29)","v":""},{"$f":"IF(Stammdaten!D29=\"\",\"\",Stammdaten!D29)","v":""},{"$f":"IF(Stammdaten!E29=\"\",\"\",Stammdaten!E29)","v":""},{"$f":"IF(Stammdaten!F29=\"\",\"\",Stammdaten!F29)","v":""},{"$f":"IF(Stammdaten!G29=\"\",\"\",Stammdaten!G29)","v":""},{"$f":"IF(Stammdaten!H29=\"\",\"\",Stammdaten!H29)","v":""}]
[{"$nulls":3},"Brutto",{"$nulls":17},{"$f":"IF(Stammdaten!C30=\"\",\"\",Stammdaten!C30)","v":""},{"$f":"IF(Stammdaten!D30=\"\",\"\",Stammdaten!D30)","v":""},{"$f":"IF(Stammdaten!E30=\"\",\"\",Stammdaten!E30)","v":""},{"$f":"IF(Stammdaten!F30=\"\",\"\",Stammdaten!F30)","v":""},{"$f":"IF(Stammdaten!G30=\"\",\"\",Stammdaten!G30)","v":""},{"$f":"IF(Stammdaten!H30=\"\",\"\",Stammdaten!H30)","v":""}]
[{"$nulls":3},{"v":50,"d":"50.00"},"Euro","Inklusive",{"v":0.19,"d":"19.00%"},"USt:",{"$f":"+IF(OR(D34=\"\",G34=\"\"),0,ROUND(D34/(1+G34)*G34,2))","v":7.98},{"$f":"+IF(I34=\"\",\"\",\"Euro\")","v":"Euro"},{"$nulls":4},{"$f":"IF(D34=\"\",\"Bewirtungskosten eingeben\",\"\")","v":""},{"$nulls":6},{"$f":"IF(Stammdaten!C31=\"\",\"\",Stammdaten!C31)","v":""},{"$f":"IF(Stammdaten!D31=\"\",\"\",Stammdaten!D31)","v":""},{"$f":"IF(Stammdaten!E31=\"\",\"\",Stammdaten!E31)","v":""},{"$f":"IF(Stammdaten!F31=\"\",\"\",Stammdaten!F31)","v":""},{"$f":"IF(Stammdaten!G31=\"\",\"\",Stammdaten!G31)","v":""},{"$f":"IF(Stammdaten!H31=\"\",\"\",Stammdaten!H31)","v":""}]
[{"$nulls":7},"Nettobetrag:",{"$f":"+IF(OR(D34=\"\",I34=\"\"),0,D34-I34)","v":{"v":42.019999999999996,"d":"42.02"}},{"$f":"+IF(I35=\"\",\"\",\"Euro\")","v":"Euro"},{"$nulls":11},{"$f":"IF(Stammdaten!C32=\"\",\"\",Stammdaten!C32)","v":""},{"$f":"IF(Stammdaten!D32=\"\",\"\",Stammdaten!D32)","v":""},{"$f":"IF(Stammdaten!E32=\"\",\"\",Stammdaten!E32)","v":""},{"$f":"IF(Stammdaten!F32=\"\",\"\",Stammdaten!F32)","v":""},{"$f":"IF(Stammdaten!G32=\"\",\"\",Stammdaten!G32)","v":""},{"$f":"IF(Stammdaten!H32=\"\",\"\",Stammdaten!H32)","v":""}]
[{"$nulls":7},"70 % aus Nettobetrag:",{"$f":"+IF(I35=\"\",,ROUND(I35*0.7,2))","v":29.41},{"$f":"+IF(I36=\"\",\"\",\"Euro\")","v":"Euro"},{"$nulls":11},{"$f":"IF(Stammdaten!C33=\"\",\"\",Stammdaten!C33)","v":""},{"$f":"IF(Stammdaten!D33=\"\",\"\",Stammdaten!D33)","v":""},{"$f":"IF(Stammdaten!E33=\"\",\"\",Stammdaten!E33)","v":""},{"$f":"IF(Stammdaten!F33=\"\",\"\",Stammdaten!F33)","v":""},{"$f":"IF(Stammdaten!G33=\"\",\"\",Stammdaten!G33)","v":""},{"$f":"IF(Stammdaten!H33=\"\",\"\",Stammdaten!H33)","v":""}]
[{"$nulls":7},"30 % aus Nettobetrag:",{"$f":"+IF(I35=\"\",0,ROUND(I35*0.3,2))","v":12.61},{"$f":"+IF(I37=\"\",\"\",\"Euro\")","v":"Euro"},{"$nulls":11},{"$f":"IF(Stammdaten!C34=\"\",\"\",Stammdaten!C34)","v":""},{"$f":"IF(Stammdaten!D34=\"\",\"\",Stammdaten!D34)","v":""},{"$f":"IF(Stammdaten!E34=\"\",\"\",Stammdaten!E34)","v":""},{"$f":"IF(Stammdaten!F34=\"\",\"\",Stammdaten!F34)","v":""},{"$f":"IF(Stammdaten!G34=\"\",\"\",Stammdaten!G34)","v":""},{"$f":"IF(Stammdaten!H34=\"\",\"\",Stammdaten!H34)","v":""}]
[]
[{"$nulls":3},{"$f":"+Stammdaten!V11&\", den \"&DAY(F6)&\".\"&MONTH(F6)&\".\"&YEAR(F6)","v":"Ortschaft, den 3.1.2022"}]
[]
[]
[]
[{"$nulls":3},"Unterschrift",null,null,"Unterschrift des Gastgebers"]
[]
[]
[]
[null,"<< Startseite",null,null,"Hilfe?",null,"Stammdaten"]
[]
[null,"© 2022 by mediaforwork - ein Unternehmensbereich der Verlag für die Deutsche Wirtschaft AG"]
[null,"Die Vervielfältigung, Verbreitung oder Veräußerung der Daten oder Texte ist unzulässig und"]
[null,"ausdrücklich nur mit Genehmigung des Verlags gestattet."]

{"sheet":"Stammdaten","index":2,"n_rows":41,"n_cols":24,"rows_kept":41,"merged":[[2,1,2,23],[5,19,5,21],[36,1,36,2],[36,3,36,11]]}
[]
[{"$nulls":23},"Stammdaten"]
[null,"Bewirtungskosten - Stammdaten"]
[]
[]
[null,null,"Mitarbeiter",{"$nulls":8},"Orte für Bewirtung",{"$nulls":7},"Allgemeine Angaben"]
[]
[null,null,"Mitarbeiter","KST","Bank","BLZ","Konto-Nr.","Sonstiges",{"$nulls":3},"Nr.","Verwendeter Name","Voller Name","Straße / Hausnr.","PLZ / Ort",{"$nulls":4},"Firma","Müller GmbH"]
[null,null,"Müller, Heinz",4711,"Walkes-Bank","0047114711","124578963",{"$nulls":4},1,"Muster-Krug","Zum vollen Krug","Musterstraße 3","47111 Musterstadt",{"$nulls":4},"Straße","Meierstraße 11"]
[null,null,"Schmitz, Dieter",4712,"Walkes-Sparkasse","123465678","1254896",{"$nulls":4},{"$f":"+IF(M10=\"\",\"\",ROW()-8)","v":2},"Gartenlaube","Zur kleinen Gartenlaube","Laubenstraße 1","47156 Musterstadt",{"$nulls":4},"PLZ","47111"]
[null,null,"Schulz, Harald",4713,"Walkes-Dreba","987654","0006659985",{"$nulls":4},{"$f":"+IF(M11=\"\",\"\",ROW()-8)","v":3},"Kleeblatt","Zur vierten Kleeblatt","Klee-Straße 76","47008 Musterstadt",{"$nulls":4},"Ort","Ortschaft"]
[null,null,"",{"$nulls":8},""]
[null,null,"",{"$nulls":8},""]
[null,null,"",{"$nulls":8},""]
[null,null,"",{"$nulls":8},""]
[null,null,"",{"$nulls":8},""]
[null,null,"",{"$nulls":8},""]
[null,null,"",{"$nulls":8},""]
[null,null,"",{"$nulls":8},""]
[null,null,"",{"$nulls":8},""]
[null,null,"",{"$nulls":8},""]
[null,null,"",{"$nulls":8},""]
[null,null,"",{"$nulls":8},""]
[null,null,"",{"$nulls":8},""]
[null,null,"",{"$nulls":8},""]
[null,null,"",{"$nulls":8},""]
[null,null,"",{"$nulls":8},""]
[null,null,"",{"$nulls":8},""]
[null,null,"",{"$nulls":8},""]
[null,null,"",{"$nulls":8},""]
[null,null,"",{"$nulls":8},""]
[null,null,"",{"$nulls":8},""]
[null,null,"",{"$nulls":8},""]
[{"$nulls":11},""]
[]
[]
[null,"<< Startseite",null,"Hilfe?"]
[]
[null,"© 2022 by mediaforwork - ein Unternehmensbereich der Verlag für die Deutsche Wirtschaft AG"]
[null,"Die Vervielfältigung, Verbreitung oder Veräußerung der Daten oder Texte ist unzulässig und"]
[null,"ausdrücklich nur mit Genehmigung des Verlags gestattet."]

{"sheet":"Hilfe","index":3,"n_rows":19,"n_cols":6,"rows_kept":19,"merged":[[2,1,2,5],[14,1,14,3]]}
[]
[{"$nulls":5},"Hilfe"]
[null,"Bewirtungskosten abrechnen - Hinweise zur Bedienung"]
[]
[{"$nulls":3},"Allgemeine Hinweise"]
[]
[]
[]
[{"$nulls":3},"Hinweise zu den Bewirtungskosten"]
[]
[]
[]
[]
[]
[null,"<< Startseite"]
[]
[null,"© 2022 by mediaforwork - ein Unternehmensbereich der Verlag für die Deutsche Wirtschaft AG"]
[null,"Die Vervielfältigung, Verbreitung oder Veräußerung der Daten oder Texte ist unzulässig und"]
[null,"ausdrücklich nur mit Genehmigung des Verlags gestattet."]

{"sheet":"Parameter_Intern","index":4,"n_rows":35,"n_cols":5,"rows_kept":35,"hidden":true}
[]
[]
[]
[null,"Nr","Tabellenblatt","Hinweise","Hyperlink"]
[null,1,"Stammdaten","Hier können Sie die Stammdaten eingeben","#Stammdaten!B3"]
[null,2,"Eingaben","Hier finden Sie die Vorlage für Ihre Bewirtungskosten-abrechnung","#Eingaben!B3"]
[null,3,"Hilfe","Hier finden Sie Hinweise zum Bewirtungskosten-kalkulator","#Hilfe!B3"]
{"$rows_empty":25}
[null,"© 2011 by BWRmed!a - ein Unternehmensbereich der Verlag für die Deutsche Wirtschaft AG"]
[null,"Die Vervielfältigung, Verbreitung oder Veräußerung der Daten oder Texte ist unzulässig und"]
[null,"ausdrücklich nur mit Genehmigung des Verlags gestattet."]