{"text_format":"3","workbook":"xlsx","n_sheets":4,"sheets":["Startseite","Berechnung","Hilfe","Parameter_Intern"],"not_rendered":{"images":1,"macros":1,"defined_names":12},"read":"whole","date_system":"1900"}

{"sheet":"Startseite","index":0,"n_rows":41,"n_cols":14,"rows_kept":41,"merged":[[10,6,14,7],[11,12,11,13],[16,3,16,4]]}
[]
[]
[]
[{"$nulls":9},"Startseite"]
[null,"Arbeitszimmerkosten"]
[]
[]
[]
[{"$nulls":3},"Tabellenblätter",{"$nulls":8},"Tabellenblatt",1]
[{"$nulls":6},"Info"]
[{"$nulls":6},{"$f":"INDEX(Parameter_Intern!C5:D6,Startseite!N9,2)","v":"In diesem Tabellenblatt bestimmen Sie Ihre absetzbaren Arbeitszimmerkosten"},{"$nulls":5},{"$f":"+N9/2","v":0.5},{"$f":"+ROUND(N9/2,0)","v":1}]
[{"$nulls":12},{"$f":"IF(M11=N11,1,2)","v":2}]
[]
[]
[]
[]
[{"$nulls":3},{"$f":"\"Bei einem Klick auf \"&H17&\" kommen Sie direkt zum entsprechenden Arbeitsblatt\"","v":"Bei einem Klick auf Berechnung kommen Sie direkt zum entsprechenden Arbeitsblatt"},{"$nulls":3},{"$f":"+HYPERLINK(VLOOKUP($N$9,Parameter_Intern!$B$5:$E$30,4,FALSE),VLOOKUP($N$9,Parameter_Intern!$B$5:$E$30,2,FALSE))","v":"Berechnung"}]
{"$rows_empty":21}
[null,"© 2023 by mediaforwork - ein Unternehmensbereich der Verlag für die Deutsche Wirtschaft AG"]
[null,"Die Vervielfältigung, Verbreitung oder Veräußerung der Daten oder Texte ist unzulässig und"]
[null,"ausdrücklich nur mit Genehmigung des Verlags gestattet."]

{"sheet":"Berechnung","index":1,"n_rows":68,"n_cols":12,"rows_kept":68,"merged":[[2,1,2,9],[5,2,5,5],[6,2,6,5],[7,2,7,5],[8,2,8,5],[9,2,9,5],[10,2,10,5],[15,2,15,5],[16,2,16,5],[17,2,17,5],[18,2,18,5],[19,2,19,5],[20,2,20,5],[21,2,21,5],[22,2,22,5],[23,2,23,5],[24,2,24,5],[25,2,25,5],[26,2,26,5],[32,2,32,4],[33,2,33,4],[34,2,34,3],[35,2,35,3],[36,2,36,3],[37,2,37,3],[44,2,44,3],[45,2,45,3],[46,2,46,3],[47,2,47,3],[48,2,48,3],[49,2,49,3],[50,2,50,3],[51,2,51,3],[52,2,52,3],[53,2,53,3],[54,2,54,3],[55,2,55,3],[56,2,56,3],[63,1,63,3]]}
[]
[{"$nulls":9},"Berechnung"]
[null,"Absetzbare Arbeitszimmerkosten berechnen"]
[]
[null,null,"Raumkosten bei Mietwohnungen"]
[null,null,"Miete Gesamtwohnung p.a.(Nettokaltmiete)",{"$nulls":3},{"v":0,"d":"0.00"}]
[null,null,"Heiz- und Warmwasserkosten gemäß Vermieterabrechnung",{"$nulls":3},{"v":0,"d":"0.00"}]
[null,null,"Übrige Betriebskosten gemäß Vermieterabrechnung",{"$nulls":3},{"v":0,"d":"0.00"}]
[null,null,"Hausratversicherung",{"$nulls":3},{"v":0,"d":"0.00"}]
[null,null,"Renovierungskosten",{"$nulls":3},{"v":0,"d":"0.00"}]
[null,null,"Sonstige Kosten",{"$nulls":3},{"v":0,"d":"0.00"}]
[]
[null,null,"Summe Raumkosten bei Mietwohnungen",{"$nulls":3},{"$f":"SUM(G6:G11)","v":{"v":0,"d":"0.00"}}]
[]
[null,null,"Raumkosten bei Eigentum"]
[null,null,"Schuldzinsen",{"$nulls":3},{"v":5000,"d":"5,000.00"}]
[null,null,"Feuer-/Hausratversicherung",{"$nulls":3},{"v":300,"d":"300.00"}]
[null,null,"Gebäudeversicherung",{"$nulls":3},{"v":250,"d":"250.00"}]
[null,null,"Straßenreinigung ",{"$nulls":3},{"v":250,"d":"250.00"}]
[null,null,"Verwaltergebühr ",{"$nulls":3},{"v":0,"d":"0.00"}]
[null,null,"Grundsteuer ",{"$nulls":3},{"v":175,"d":"175.00"}]
[null,null,"Gebäude-AfA 2% ",{"$nulls":3},{"v":5000,"d":"5,000.00"}]
[null,null,"Reperatur-/Renovierungskosten",{"$nulls":3},{"v":0,"d":"0.00"}]
[null,null,"Sonstige Kosten",{"$nulls":3},{"v":0,"d":"0.00"}]
[null,null,"Sonstige Kosten",{"$nulls":3},{"v":0,"d":"0.00"}]
[null,null,"Sonstige Kosten",{"$nulls":3},{"v":0,"d":"0.00"}]
[null,null,"Sonstige Kosten",{"$nulls":3},{"v":0,"d":"0.00"}]
[]
[null,null,"Summe Raumkosten bei Eigentum",{"$nulls":3},{"$f":"SUM(G16:G27)","v":{"v":10975,"d":"10,975.00"}}]
[{"$nulls":11},{"$f":"+IF(AND(G13>0,G29>0),\"Entweder Mietwohung oder Eigentum eingeben!\",\"\")","v":""}]
[null,null,"Gesamte Raumkosten",{"$nulls":3},{"$f":"SUM(G29,G13)","v":{"v":10975,"d":"10,975.00"}}]
[]
[null,null,"gesamte Wohnfläche in qm",null,null,{"v":100,"d":"100 qm"}]
[null,null,"Arbeitszimmer in qm",null,null,{"v":40,"d":"40 qm"},{"$f":"+IF(E35>0.3,\" Kostenanteil sehr hoch!\",\"\")","v":" Kostenanteil sehr hoch!"}]
[null,null,"Arbeitszimmeranteil",null,{"$f":"IF(F33>0,F34/F33,0)","v":{"v":0.4,"d":"40%"}},{"$f":"G31*E35","v":{"v":4390,"d":"4,390.00"}}]
[null,null,"Zimmer Berufsmittelpunkt?",null,"ja"]
[null,null,"Nutzung >50% der Tätigkeit?",null,"ja"]
[null,null,"Höchstbetrag ",null,{"v":1250,"d":"1,250.00"}]
[]
[null,null,"Abzugsfähige Arbeitszimmerkosten",{"$nulls":5},{"$f":"IF(E36=\"ja\",F35,IF(E37=\"ja\",MIN(F35,E38),0))","v":{"v":4390,"d":"4,390.00"}}]
[]
[]
[null,null,"Arbeitsmittel",null,"Kaufpreis","AfA","Ansatz"]
[]
[null,null,"Computer",null,{"v":750,"d":"750.00"},{"v":250,"d":"250.00"},{"v":250,"d":"250.00"}]
[null,null,"Drucker",null,{"v":199,"d":"199.00"},{"v":199,"d":"199.00"},{"v":199,"d":"199.00"}]
[null,null,"Aktenregal",null,{"v":900,"d":"900.00"},{"v":90,"d":"90.00"},{"v":90,"d":"90.00"}]
[null,null,"Notebook",null,{"v":1200,"d":"1,200.00"},{"v":400,"d":"400.00"},{"v":400,"d":"400.00"}]
[null,null,"Schreibtisch",null,{"v":500,"d":"500.00"},{"v":50,"d":"50.00"},{"v":50,"d":"50.00"}]
[null,null,"Sonstiges"]
[null,null,"Sonstiges"]
[null,null,"Sonstiges"]
[null,null,"Sonstiges"]
[null,null,"Sonstiges"]
[null,null,"Sonstiges"]
[null,null,"Sonstiges"]
[null,null,"Sonstiges"]
[]
[null,null,"Summe abzugsfähiger Arbeitsmittel",{"$nulls":5},{"$f":"SUM(G43:G57)","v":{"v":989,"d":"989.00"}}]
[]
[null,null,"Summe abzugsfähiger Arbeitszimmerkosten",{"$nulls":5},{"$f":"+I59+I40","v":{"v":5379,"d":"5,379.00"}}]
[]
[]
[null,"<< Startseite",{"$nulls":6},"Hilfe?"]
[]
[null,"© 2023 by mediaforwork - ein Unternehmensbereich der Verlag für die Deutsche Wirtschaft AG"]
[null,"Die Vervielfältigung, Verbreitung oder Veräußerung der Daten oder Texte ist unzulässig und"]
[null,"ausdrücklich nur mit Genehmigung des Verlags gestattet."]

{"sheet":"Hilfe","index":2,"n_rows":19,"n_cols":6,"rows_kept":19,"merged":[[2,1,2,5],[14,1,14,3]]}
[]
[{"$nulls":5},"Hilfe"]
[null,"Arbeitszimmer - Hilfe"]
[]
[{"$nulls":3},"Allgemeine Hinweise"]
[]
[]
[]
[{"$nulls":3},"Hinweise zum Arbeitszimmer-Tool"]
[]
[]
[]
[]
[]
[null,"<< Startseite"]
[]
[null,"© 2023 by mediaforwork - ein Unternehmensbereich der Verlag für die Deutsche Wirtschaft AG"]
[null,"Die Vervielfältigung, Verbreitung oder Veräußerung der Daten oder Texte ist unzulässig und"]
[null,"ausdrücklich nur mit Genehmigung des Verlags gestattet."]

{"sheet":"Parameter_Intern","index":3,"n_rows":35,"n_cols":5,"rows_kept":35,"hidden":true}
[]
[]
[]
[null,"Nr","Tabellenblatt","Hinweise","Hyperlink"]
[null,1,"Berechnung","In diesem Tabellenblatt bestimmen Sie Ihre absetzbaren Arbeitszimmerkosten","#Berechnung!B3"]
[null,2,"Hilfe","Hier finden Sie nähere Informationen über die Anwendung.","#Hilfe!B3"]
{"$rows_empty":26}
[null,"© 2011 by BWRmed!a - ein Unternehmensbereich der Verlag für die Deutsche Wirtschaft AG"]
[null,"Die Vervielfältigung, Verbreitung oder Veräußerung der Daten oder Texte ist unzulässig und"]
[null,"ausdrücklich nur mit Genehmigung des Verlags gestattet."]