{"text_format":"3","workbook":"xlsx","n_sheets":6,"sheets":["Startseite","Eingaben","Berechnung","Beispiel","Hilfe","Parameter_Intern"],"not_rendered":{"images":3,"macros":1,"defined_names":19},"read":"whole","date_system":"1900"}

{"sheet":"Startseite","index":0,"n_rows":42,"n_cols":14,"rows_kept":42,"merged":[[10,6,14,7],[11,12,11,13],[16,3,16,4]]}
[]
[]
[]
[{"$nulls":9},"Startseite"]
[null,"Abschreibungsvorteile"]
[]
[]
[]
[{"$nulls":3},"Tabellenblätter",{"$nulls":8},"Tabellenblatt",1]
[{"$nulls":6},"Info"]
[{"$nulls":6},{"$f":"INDEX(Parameter_Intern!C5:D8,Startseite!N9,2)","v":"Hier geben Sie die Daten für die Berechnung der Abschreibung ein"},{"$nulls":5},{"$f":"+N9/2","v":0.5},{"$f":"+ROUND(N9/2,0)","v":1}]
[{"$nulls":12},{"$f":"IF(M11=N11,1,2)","v":2}]
[]
[]
[]
[]
[{"$nulls":3},{"$f":"\"Bei einem Klick auf \"&H17&\" kommen Sie direkt zum entsprechenden Arbeitsblatt\"","v":"Bei einem Klick auf Eingaben kommen Sie direkt zum entsprechenden Arbeitsblatt"},{"$nulls":3},{"$f":"+HYPERLINK(VLOOKUP($N$9,Parameter_Intern!$B$5:$E$30,4,FALSE),VLOOKUP($N$9,Parameter_Intern!$B$5:$E$30,2,FALSE))","v":"Eingaben"}]
{"$rows_empty":22}
[null,"© 2023 by mediaforwork - ein Unternehmensbereich der Verlag für die Deutsche Wirtschaft AG"]
[null,"Die Vervielfältigung, Verbreitung oder Veräußerung der Daten oder Texte ist unzulässig und"]
{"$rows_left_out":2}
{"sheet":"Eingaben","index":1,"n_rows":83,"n_cols":11,"rows_kept":83,"merged":[[1,1,1,10],[3,3,3,6],[5,6,5,8],[6,6,6,8],[7,6,7,8],[12,3,12,6],[18,6,18,8],[44,3,44,6],[51,1,51,3]]}
[{"$nulls":10},"Eingaben"]
[null,"Abschreibungen - Eingaben"]
[]
[{"$nulls":3},"Stammdaten"]
[]
[{"$nulls":3},"Firma"]
[{"$nulls":3},"Straße"]
[{"$nulls":3},"PLZ, Ort"]
[]
[]
[]
[]
[{"$nulls":3},"Ermittlung der Bemessungsgrundlage"]
[]
[{"$nulls":6},{"$f":"IF(OR(ISTEXT(G31),ISTEXT(G33),ISTEXT(G30),ISTEXT(G47),ISTEXT(G48),G31<0,G31=\"\",G33<0,G33<>INT(G33),G33=\"\",G26=\"\"),\"Fehlerhafte Eingabe. Berechnung unmöglich!\",IF(OR(ISNUMBER(G21)=FALSE,G21=\"\"),\"Falsche oder fehlende Datumseingabe!\",\"\"))","v":"Fehlerhafte Eingabe. Berechnung unmöglich!"}]
[{"$nulls":3},"Allgemeine Angaben:"]
[]
[{"$nulls":3},"Inventarnummer:"]
[{"$nulls":3},"Anlage/Maschine:"]
[]
{"$rows_left_out":58}
{"sheet":"Berechnung","index":2,"n_rows":41,"n_cols":18,"rows_kept":41,"merged":[[0,1,0,13],[1,1,1,14],[3,5,3,11],[4,6,4,11],[7,3,7,4],[7,6,7,8],[7,10,7,11],[7,13,7,14],[36,1,36,3]]}
[null,{"$f":"Eingaben!G15","v":"Fehlerhafte Eingabe. Berechnung unmöglich!"},{"$nulls":12},"Berechnung",null,{"$f":"+IF(B1=\"\",\"\",1)","v":1}]
[null,"Abschreibung - Berechnung"]
[]
[null,{"$f":"IF(+Eingaben!G6=\"\",\"\",Eingaben!G6)","v":""},{"$nulls":3},"Ermittlung der linearen und degressiven Abschreibungen für",{"$nulls":8},{"$f":"+\"Inventarnummer: \"&Eingaben!G18&\" \"","v":"Inventarnummer:  "}]
[{"$nulls":6},{"$f":"IF(Eingaben!G19=\"\",\"\",Eingaben!G19)","v":""}]
[]
[]
[null,"Jahr",null,"Reine Degressive AfA",null,null,"Wechsel degressive à  lineare AfA",{"$nulls":3},"Degressive Gesamttabelle",null,null,"Lineare AfA",{"$nulls":3},{"$f":"IF(AND(Q35>Eingaben!G33,Q35<22),\"????\",\"OK\")","v":"OK"}]
[]
[{"$nulls":3},"AfA in Euro","Zeitwert",null,"AfA in Euro","Zeitwert","Jetzt",null,"AfA in Euro","Zeitwert",null,"AfA in Euro","Zeitwert"]
[]
[null,0,null,null,{"$f":"IF(OR(Eingaben!$G$47=0,Eingaben!$G$48=0),\"\",IF($B$1<>\"\",\"\",Eingaben!G31))","v":""},{"$nulls":6},{"$f":"IF(OR(Eingaben!$G$47=0,Eingaben!$G$48=0),\"\",IF($B$1<>\"\",\"\",Eingaben!G31))","v":""},null,null,{"$f":"IF($B$1<>\"\",\"\",Eingaben!G31)","v":""},null,{"$f":"+IF(Eingaben!$G$42<=0,\"\",IF(D12=\"\",\"\",IF(B12<Eingaben!$G$42,\"\",Berechnung!B12)))","v":""}]
[null,{"$f":"B12+1","v":1},null,{"$f":"IF(OR(Eingaben!G47=0,Eingaben!G48=0),\"\",IF($B$1<>\"\",\"\",IF(B13<=Eingaben!G$33,E12*Eingaben!G$37/12*Eingaben!G39,\"\")))","v":""},{"$f":"IF(OR(Eingaben!$G$47=0,Eingaben!$G$48=0),\"\",IF($B$1<>\"\",\"\",IF(B13<=Eingaben!G$33,E12-D13,\"\")))","v":""},null,{"$f":"IF(OR($B$1<>\"\",$R$8<>\"OK\"),\"\",IF(B13<=Eingaben!G$33,IF(G12=\"\",IF(H12<>\"\",H12/(Eingaben!G$33-B13+1),\"\"),G12),\"\"))","v":""},{"$f":"IF(OR($B$1<>\"\",$R$8<>\"OK\"),\"\",IF(B13<=Eingaben!G$33,IF(H12=\"\",IF(OR(E13<=N$13,B13=Q$35),E13,\"\"),H12-G13),\"\"))","v":""},{"$f":"IF(Eingaben!G31=\"\",\"\",IF($Q$35+1=B13,\"ç\",\"\"))","v":""},null,{"$f":"IF($B$1<>\"\",\"\",IF(B13<=Eingaben!G$33,IF(G13=\"\",D13,G13),\"\"))","v":""},{"$f":"IF(OR(Eingaben!$G$47=0,Eingaben!$G$48=0),\"\",IF($B$1<>\"\",\"\",IF(B13<=Eingaben!G$33,L12-K13,\"\")))","v":""},null,{"$f":"IF($B$1<>\"\",\"\",IF(B13<=Eingaben!G$33,O$12*Eingaben!G$36/12*Eingaben!G39,\"\"))","v":""},{"$f":"IF($B$1<>\"\",\"\",IF(B13<=Eingaben!G$33,O12-N13,\"\"))","v":""},null,{"$f":"+IF(Eingaben!$G$42<=0,\"\",IF(D13=\"\",\"\",IF(B13<Eingaben!$G$42,\"\",Berechnung!B13)))","v":""}]
[null,2,null,{"$f":"IF(OR(Eingaben!$G$47=0,Eingaben!$G$48=0),\"\",IF($B$1<>\"\",\"\",IF(B14=Eingaben!$G$33,Berechnung!E13,IF(B14<=Eingaben!G$33,E13*Eingaben!G$37,\"\"))))","v":""},{"$f":"IF(OR(Eingaben!$G$47=0,Eingaben!$G$48=0),\"\",IF($B$1<>\"\",\"\",IF(B14<=Eingaben!G$33,E13-D14,\"\")))","v":""},null,{"$f":"IF(OR($B$1<>\"\",$R$8<>\"OK\"),\"\",IF(B14<=Eingaben!G$33,IF(G13=\"\",IF(H13<>\"\",H13/(Eingaben!G$33-B14+1),\"\"),G13),\"\"))","v":""},{"$f":"IF(OR($B$1<>\"\",$R$8<>\"OK\"),\"\",IF(B14<=Eingaben!G$33,IF(H13=\"\",IF(OR(E14<=N$13,B14=Q$35),E14,\"\"),H13-G14),\"\"))","v":""},{"$f":"+IF($Q$35+1=B14,\"ç\",\"\")","v":""},null,{"$f":"IF($B$1<>\"\",\"\",IF(B14<=Eingaben!G$33,IF(G14=\"\",D14,G14),\"\"))","v":""},{"$f":"IF(OR(Eingaben!$G$47=0,Eingaben!$G$48=0),\"\",IF($B$1<>\"\",\"\",IF(B14<=Eingaben!G$33,L13-K14,\"\")))","v":""},null,{"$f":"IF($B$1<>\"\",\"\",IF(B14=Eingaben!$G$33,Berechnung!O13,IF(B14<=Eingaben!G$33,O$12*Eingaben!G$36,\"\")))","v":""},{"$f":"IF($B$1<>\"\",\"\",IF(B14<=Eingaben!G$33,O13-N14,\"\"))","v":""},null,{"$f":"+IF(Eingaben!$G$42<=0,\"\",IF(D14=\"\",\"\",IF(B14<Eingaben!$G$42,\"\",Berechnung!B14)))","v":""}]
[null,3,null,{"$f":"IF(OR(Eingaben!$G$47=0,Eingaben!$G$48=0),\"\",IF($B$1<>\"\",\"\",IF(B15=Eingaben!$G$33,Berechnung!E14,IF(B15<=Eingaben!G$33,E14*Eingaben!G$37,\"\"))))","v":""},{"$f":"IF(OR(Eingaben!$G$47=0,Eingaben!$G$48=0),\"\",IF($B$1<>\"\",\"\",IF(B15<=Eingaben!G$33,E14-D15,\"\")))","v":""},null,{"$f":"IF(OR($B$1<>\"\",$R$8<>\"OK\"),\"\",IF(B15<=Eingaben!G$33,IF(G14=\"\",IF(H14<>\"\",H14/(Eingaben!G$33-B15+1),\"\"),G14),\"\"))","v":""},{"$f":"IF(OR($B$1<>\"\",$R$8<>\"OK\"),\"\",IF(B15<=Eingaben!G$33,IF(H14=\"\",IF(OR(E15<=N$13,B15=Q$35),E15,\"\"),H14-G15),\"\"))","v":""},"",null,{"$f":"IF($B$1<>\"\",\"\",IF(B15<=Eingaben!G$33,IF(G15=\"\",D15,G15),\"\"))","v":""},{"$f":"IF(OR(Eingaben!$G$47=0,Eingaben!$G$48=0),\"\",IF($B$1<>\"\",\"\",IF(B15<=Eingaben!G$33,L14-K15,\"\")))","v":""},null,{"$f":"IF($B$1<>\"\",\"\",IF(B15=Eingaben!$G$33,Berechnung!O14,IF(B15<=Eingaben!G$33,O$12*Eingaben!G$36,\"\")))","v":""},{"$f":"IF($B$1<>\"\",\"\",IF(B15<=Eingaben!G$33,O14-N15,\"\"))","v":""},null,{"$f":"+IF(Eingaben!$G$42<=0,\"\",IF(D15=\"\",\"\",IF(B15<Eingaben!$G$42,\"\",Berechnung!B15)))","v":""}]
[null,4,null,{"$f":"IF(OR(Eingaben!$G$47=0,Eingaben!$G$48=0),\"\",IF($B$1<>\"\",\"\",IF(B16=Eingaben!$G$33,Berechnung!E15,IF(B16<=Eingaben!G$33,E15*Eingaben!G$37,\"\"))))","v":""},{"$f":"IF(OR(Eingaben!$G$47=0,Eingaben!$G$48=0),\"\",IF($B$1<>\"\",\"\",IF(B16<=Eingaben!G$33,E15-D16,\"\")))","v":""},null,{"$f":"IF(OR($B$1<>\"\",$R$8<>\"OK\"),\"\",IF(B16<=Eingaben!G$33,IF(G15=\"\",IF(H15<>\"\",H15/(Eingaben!G$33-B16+1),\"\"),G15),\"\"))","v":""},{"$f":"IF(OR($B$1<>\"\",$R$8<>\"OK\"),\"\",IF(B16<=Eingaben!G$33,IF(H15=\"\",IF(OR(E16<=N$13,B16=Q$35),E16,\"\"),H15-G16),\"\"))","v":""},"",null,{"$f":"IF($B$1<>\"\",\"\",IF(B16<=Eingaben!G$33,IF(G16=\"\",D16,G16),\"\"))","v":""},{"$f":"IF(OR(Eingaben!$G$47=0,Eingaben!$G$48=0),\"\",IF($B$1<>\"\",\"\",IF(B16<=Eingaben!G$33,L15-K16,\"\")))","v":""},null,{"$f":"IF($B$1<>\"\",\"\",IF(B16=Eingaben!$G$33,Berechnung!O15,IF(B16<=Eingaben!G$33,O$12*Eingaben!G$36,\"\")))","v":""},{"$f":"IF($B$1<>\"\",\"\",IF(B16<=Eingaben!G$33,O15-N16,\"\"))","v":""},null,{"$f":"+IF(Eingaben!$G$42<=0,\"\",IF(D16=\"\",\"\",IF(B16<Eingaben!$G$42,\"\",Berechnung!B16)))","v":""}]
[null,5,null,{"$f":"IF(OR(Eingaben!$G$47=0,Eingaben!$G$48=0),\"\",IF($B$1<>\"\",\"\",IF(B17=Eingaben!$G$33,Berechnung!E16,IF(B17<=Eingaben!G$33,E16*Eingaben!G$37,\"\"))))","v":""},{"$f":"IF(OR(Eingaben!$G$47=0,Eingaben!$G$48=0),\"\",IF($B$1<>\"\",\"\",IF(B17<=Eingaben!G$33,E16-D17,\"\")))","v":""},null,{"$f":"IF(OR($B$1<>\"\",$R$8<>\"OK\"),\"\",IF(B17<=Eingaben!G$33,IF(G16=\"\",IF(H16<>\"\",H16/(Eingaben!G$33-B17+1),\"\"),G16),\"\"))","v":""},{"$f":"IF(OR($B$1<>\"\",$R$8<>\"OK\"),\"\",IF(B17<=Eingaben!G$33,IF(H16=\"\",IF(OR(E17<=N$13,B17=Q$35),E17,\"\"),H16-G17),\"\"))","v":""},"",null,{"$f":"IF($B$1<>\"\",\"\",IF(B17<=Eingaben!G$33,IF(G17=\"\",D17,G17),\"\"))","v":""},{"$f":"IF(OR(Eingaben!$G$47=0,Eingaben!$G$48=0),\"\",IF($B$1<>\"\",\"\",IF(B17<=Eingaben!G$33,L16-K17,\"\")))","v":""},null,{"$f":"IF($B$1<>\"\",\"\",IF(B17=Eingaben!$G$33,Berechnung!O16,IF(B17<=Eingaben!G$33,O$12*Eingaben!G$36,\"\")))","v":""},{"$f":"IF($B$1<>\"\",\"\",IF(B17<=Eingaben!G$33,O16-N17,\"\"))","v":""},null,{"$f":"+IF(Eingaben!$G$42<=0,\"\",IF(D17=\"\",\"\",IF(B17<Eingaben!$G$42,\"\",Berechnung!B17)))","v":""}]
[null,6,null,{"$f":"IF(OR(Eingaben!$G$47=0,Eingaben!$G$48=0),\"\",IF($B$1<>\"\",\"\",IF(B18=Eingaben!$G$33,Berechnung!E17,IF(B18<=Eingaben!G$33,E17*Eingaben!G$37,\"\"))))","v":""},{"$f":"IF(OR(Eingaben!$G$47=0,Eingaben!$G$48=0),\"\",IF($B$1<>\"\",\"\",IF(B18<=Eingaben!G$33,E17-D18,\"\")))","v":""},null,{"$f":"IF(OR($B$1<>\"\",$R$8<>\"OK\"),\"\",IF(B18<=Eingaben!G$33,IF(G17=\"\",IF(H17<>\"\",H17/(Eingaben!G$33-B18+1),\"\"),G17),\"\"))","v":""},{"$f":"IF(OR($B$1<>\"\",$R$8<>\"OK\"),\"\",IF(B18<=Eingaben!G$33,IF(H17=\"\",IF(OR(E18<=N$13,B18=Q$35),E18,\"\"),H17-G18),\"\"))","v":""},"",null,{"$f":"IF($B$1<>\"\",\"\",IF(B18<=Eingaben!G$33,IF(G18=\"\",D18,G18),\"\"))","v":""},{"$f":"IF(OR(Eingaben!$G$47=0,Eingaben!$G$48=0),\"\",IF($B$1<>\"\",\"\",IF(B18<=Eingaben!G$33,L17-K18,\"\")))","v":""},null,{"$f":"IF($B$1<>\"\",\"\",IF(B18=Eingaben!$G$33,Berechnung!O17,IF(B18<=Eingaben!G$33,O$12*Eingaben!G$36,\"\")))","v":""},{"$f":"IF($B$1<>\"\",\"\",IF(B18<=Eingaben!G$33,O17-N18,\"\"))","v":""},null,{"$f":"+IF(Eingaben!$G$42<=0,\"\",IF(D18=\"\",\"\",IF(B18<Eingaben!$G$42,\"\",Berechnung!B18)))","v":""}]
[null,7,null,{"$f":"IF(OR(Eingaben!$G$47=0,Eingaben!$G$48=0),\"\",IF($B$1<>\"\",\"\",IF(B19=Eingaben!$G$33,Berechnung!E18,IF(B19<=Eingaben!G$33,E18*Eingaben!G$37,\"\"))))","v":""},{"$f":"IF(OR(Eingaben!$G$47=0,Eingaben!$G$48=0),\"\",IF($B$1<>\"\",\"\",IF(B19<=Eingaben!G$33,E18-D19,\"\")))","v":""},null,{"$f":"IF(OR($B$1<>\"\",$R$8<>\"OK\"),\"\",IF(B19<=Eingaben!G$33,IF(G18=\"\",IF(H18<>\"\",H18/(Eingaben!G$33-B19+1),\"\"),G18),\"\"))","v":""},{"$f":"IF(OR($B$1<>\"\",$R$8<>\"OK\"),\"\",IF(B19<=Eingaben!G$33,IF(H18=\"\",IF(OR(E19<=N$13,B19=Q$35),E19,\"\"),H18-G19),\"\"))","v":""},"",null,{"$f":"IF($B$1<>\"\",\"\",IF(B19<=Eingaben!G$33,IF(G19=\"\",D19,G19),\"\"))","v":""},{"$f":"IF(OR(Eingaben!$G$47=0,Eingaben!$G$48=0),\"\",IF($B$1<>\"\",\"\",IF(B19<=Eingaben!G$33,L18-K19,\"\")))","v":""},null,{"$f":"IF($B$1<>\"\",\"\",IF(B19=Eingaben!$G$33,Berechnung!O18,IF(B19<=Eingaben!G$33,O$12*Eingaben!G$36,\"\")))","v":""},{"$f":"IF($B$1<>\"\",\"\",IF(B19<=Eingaben!G$33,O18-N19,\"\"))","v":""},null,{"$f":"+IF(Eingaben!$G$42<=0,\"\",IF(D19=\"\",\"\",IF(B19<Eingaben!$G$42,\"\",Berechnung!B19)))","v":""}]
[null,8,null,{"$f":"IF(OR(Eingaben!$G$47=0,Eingaben!$G$48=0),\"\",IF($B$1<>\"\",\"\",IF(B20=Eingaben!$G$33,Berechnung!E19,IF(B20<=Eingaben!G$33,E19*Eingaben!G$37,\"\"))))","v":""},{"$f":"IF(OR(Eingaben!$G$47=0,Eingaben!$G$48=0),\"\",IF($B$1<>\"\",\"\",IF(B20<=Eingaben!G$33,E19-D20,\"\")))","v":""},null,{"$f":"IF(OR($B$1<>\"\",$R$8<>\"OK\"),\"\",IF(B20<=Eingaben!G$33,IF(G19=\"\",IF(H19<>\"\",H19/(Eingaben!G$33-B20+1),\"\"),G19),\"\"))","v":""},{"$f":"IF(OR($B$1<>\"\",$R$8<>\"OK\"),\"\",IF(B20<=Eingaben!G$33,IF(H19=\"\",IF(OR(E20<=N$13,B20=Q$35),E20,\"\"),H19-G20),\"\"))","v":""},"",null,{"$f":"IF($B$1<>\"\",\"\",IF(B20<=Eingaben!G$33,IF(G20=\"\",D20,G20),\"\"))","v":""},{"$f":"IF(OR(Eingaben!$G$47=0,Eingaben!$G$48=0),\"\",IF($B$1<>\"\",\"\",IF(B20<=Eingaben!G$33,L19-K20,\"\")))","v":""},null,{"$f":"IF($B$1<>\"\",\"\",IF(B20=Eingaben!$G$33,Berechnung!O19,IF(B20<=Eingaben!G$33,O$12*Eingaben!G$36,\"\")))","v":""},{"$f":"IF($B$1<>\"\",\"\",IF(B20<=Eingaben!G$33,O19-N20,\"\"))","v":""},null,{"$f":"+IF(Eingaben!$G$42<=0,\"\",IF(D20=\"\",\"\",IF(B20<Eingaben!$G$42,\"\",Berechnung!B20)))","v":""}]
{"$rows_left_out":22}
{"sheet":"Beispiel","index":3,"n_rows":56,"n_cols":11,"rows_kept":56,"merged":[[1,1,1,10],[3,3,3,6],[5,6,5,8],[6,6,6,8],[7,6,7,8],[12,3,12,6],[18,6,18,8],[44,3,44,6],[51,1,51,3]]}
[{"$nulls":10},"Beispiel"]
[null,"Abschreibungen - Eingaben"]
[]
[{"$nulls":3},"Stammdaten"]
[]
[{"$nulls":3},"Firma",null,null,"Müller GmbH & CoKG"]
[{"$nulls":3},"Straße",null,null,"Müllerweg 7"]
[{"$nulls":3},"PLZ, Ort",null,null,"47123 Müllersdorf"]
[]
[]
[]
[]
[{"$nulls":3},"Ermittlung der Bemessungsgrundlage"]
[]
[{"$nulls":6},{"$f":"IF(OR(ISTEXT(G31),ISTEXT(G33),ISTEXT(G30),ISTEXT(G47),ISTEXT(G48),G31<0,G31=\"\",G33<0,G33<>INT(G33),G33=\"\",G26=\"\"),\"Fehlerhafte Eingabe. Berechnung unmöglich!\",IF(OR(ISNUMBER(G21)=FALSE,G21=\"\"),\"Falsche oder fehlende Datumseingabe!\",\"\"))","v":""}]
[{"$nulls":3},"Allgemeine Angaben:"]
[]
[{"$nulls":3},"Inventarnummer:",null,null,4711]
[{"$nulls":3},"Anlage/Maschine:",null,null,"Fräsmaschine Typ GanzSchönSchnell"]
[]
{"$rows_left_out":37}
{"sheet":"Hilfe","index":4,"n_rows":23,"n_cols":9,"rows_kept":23,"merged":[[2,1,2,8],[18,1,18,3]]}
[]
[{"$nulls":8},"Hilfe"]
[null,"Abschreibungsvorteile - Hilfe"]
[]
[null,null,"Allgemeine Hinweise"]
[]
[]
[]
[null,null,"Hinweise zum Tool Abschreibungsvorteile"]
{"$rows_empty":9}
[null,"<< Startseite"]
[]
[null,"© 2023 by mediaforwork - ein Unternehmensbereich der Verlag für die Deutsche Wirtschaft AG"]
[null,"Die Vervielfältigung, Verbreitung oder Veräußerung der Daten oder Texte ist unzulässig und"]
[null,"ausdrücklich nur mit Genehmigung des Verlags gestattet."]

{"sheet":"Parameter_Intern","index":5,"n_rows":35,"n_cols":5,"rows_kept":35,"hidden":true}
[]
[]
[]
[null,"Nr","Tabellenblatt","Hinweise","Hyperlink"]
[null,1,"Eingaben","Hier geben Sie die Daten für die Berechnung der Abschreibung ein","#Eingaben!B2"]
[null,2,"Berechnung","In diesem Arbeitsblatt wird die Abschreibung berechnet","#Berechnung!B2"]
[null,3,"Beispiel","Hier finden Sie ein Beispiel für die Berechnung der Abschreibung","#Beispiel!B2"]
[null,4,"Hilfe","Hier finden Sie nähere Informationen über die Anwendung.","#Hilfe!B3"]
{"$rows_empty":24}
[null,"© 2011 by BWRmed!a - ein Unternehmensbereich der Verlag für die Deutsche Wirtschaft AG"]
[null,"Die Vervielfältigung, Verbreitung oder Veräußerung der Daten oder Texte ist unzulässig und"]
[null,"ausdrücklich nur mit Genehmigung des Verlags gestattet."]