{"text_format":"3","workbook":"xlsx","n_sheets":16,"sheets":["Stammdaten","Steuerung","Einnahmen","Ausgaben","Bewirtungskosten","Anlageverzeichnis Seite 1","Anlageverzeichnis Seite 2","Anlageverzeichnis Seite 3","Anlageverzeichnis Seite 4","Seite 1","Seite 2","Seite 3","Seite 4","UStVA_1","UStVA_2","Interne Parmeter"],"not_rendered":{"macros":1,"defined_names":18},"read":"whole","date_system":"1900"}

{"sheet":"Stammdaten","index":0,"n_rows":49,"n_cols":31,"rows_kept":49,"merged":[[4,6,4,53],[9,9,9,26],[9,30,9,50],[10,9,10,26],[10,30,10,50],[11,9,11,26],[11,30,11,50],[12,9,12,26],[12,30,12,50],[13,9,13,26],[13,30,13,50],[14,9,14,26],[14,30,14,50],[15,9,15,26],[15,30,15,50],[16,9,16,26],[16,30,16,50],[17,9,17,26],[17,30,17,50],[18,9,18,26],[18,30,18,50],[19,9,19,26],[19,30,19,50],[27,30,27,34],[28,30,28,50],[29,30,29,50],[30,30,30,50],[31,30,31,34],[32,30,32,34],[33,9,33,26],[33,30,33,37],[34,9,34,26],[34,30,34,34],[34,35,34,50],[35,9,35,26],[35,30,35,34],[35,35,35,50],[36,9,36,26],[36,30,36,50],[37,9,37,26],[37,30,37,50],[38,9,38,26],[38,30,38,50],[39,9,39,26],[39,30,39,50],[40,9,40,26],[40,30,40,33],[40,34,40,50],[41,9,41,26],[41,30,41,33],[41,34,41,50]]}
[]
[]
[]
[]
[{"$nulls":6},"Stammdaten"]
[]
[]
[]
{"$rows_left_out":36}
{"sheet":"Steuerung","index":1,"n_rows":55,"n_cols":7,"rows_kept":55,"merged":[[1,1,1,8],[5,3,5,5],[20,3,20,5]]}
[]
[null,"Zeilensteuerung für die EÜR"]
[]
[]
[]
[{"$nulls":3},"Einnahmen"]
[]
[]
{"$rows_left_out":48}
{"sheet":"Einnahmen","index":2,"n_rows":204,"n_cols":30,"rows_kept":204}
[]
[]
[null,"1",{"$f":"1+B3","v":2},3,4,5,6,7,8,9,10,11,12,13,14,{"$nulls":12},5]
[null,"Rng-Nr.","Zeile","Rng.-Datum","Monat","Zahl-Datum","Monat","Art der Einnahme","Netto-Betrag","USt%","USt","Brutto-Betrag","Bemerkung","Übergabe_EÜR","Übergabe_EÜR_UST",null,"Hinweis",{"$nulls":3},{"$f":"+B3","v":"1"},{"$f":"+D3","v":3},{"$f":"+H3","v":7},{"$f":"+L3","v":11},{"$f":"+F3","v":5},null,"∑1","∑2","OK","BF"]
[null,"1",{"$f":"IF(H5=\"\",\"\",VLOOKUP(H5,Steuerung!$E$11:$G$17,3,FALSE))","v":"15"},"2023-12-31",{"$f":"IF(Stammdaten!$AE$29=\"2 - Vereinbarte Entgelte\",IF(ISNUMBER(D5),IF(YEAR(D5)<Stammdaten!$AE$28,1,IF(YEAR(D5)>Stammdaten!$AE$28,12,MONTH(D5))),\"\"),\"\")","v":""},"2024-01-13",{"$f":"IF(Stammdaten!$AE$29=\"1 - Vereinnahmte Entgelte\",IF(ISNUMBER(F5),IF(YEAR(F5)<Stammdaten!$AE$28,1,IF(YEAR(F5)>Stammdaten!$AE$28,12,MONTH(F5))),\"\"),\"\")","v":1},"Einnahmen UST-pfl.",{"v":1000,"d":"1,000.00"},{"v":0.19,"d":"19%"},{"$f":"+IF(AND(ISNUMBER(I5),ISNUMBER(J5)),ROUND(I5*J5,2),\"\")","v":{"v":190,"d":"190.00"}},{"$f":"+IF(AND(ISNUMBER(I5),ISNUMBER(K5)),I5+K5,\"\")","v":{"v":1190,"d":"1,190.00"}},null,{"$f":"+IF(Stammdaten!$AE$30=\"1 - Ja\",Einnahmen!I5,Einnahmen!L5)","v":{"v":1000,"d":"1,000.00"}},{"$f":"+IF(Stammdaten!$AE$30=\"1 - Ja\",K5,0)","v":{"v":190,"d":"190.00"}},null,{"$f":"+IF(AD5=0,\"\",\"Eingaben unvollständig\")","v":""},{"$nulls":3},{"$f":"+IF(B5=\"\",0,1)","v":1},{"$f":"+IF(ISNUMBER(D5),1,0)","v":1},{"$f":"+IF(H5=\"\",0,1)","v":1},{"$f":"+IF(ISNUMBER(L5),1,0)","v":1},{"$f":"+IF(ISNUMBER(F5),1,0)","v":1},null,{"$f":"+SUM(U5:Z5)","v":5},{"$f":"+$AB$3","v":5},{"$f":"+IF(AA5=AB5,1,0)","v":1},{"$f":"+IF(AND(AA5>0,AC5=0),1,0)","v":0}]
[null,"2",{"$f":"IF(H6=\"\",\"\",VLOOKUP(H6,Steuerung!$E$11:$G$17,3,FALSE))","v":"15"},"2024-02-15",{"$f":"IF(Stammdaten!$AE$29=\"2 - Vereinbarte Entgelte\",IF(ISNUMBER(D6),IF(YEAR(D6)<Stammdaten!$AE$28,1,IF(YEAR(D6)>Stammdaten!$AE$28,12,MONTH(D6))),\"\"),\"\")","v":""},"2024-02-28",{"$f":"IF(Stammdaten!$AE$29=\"1 - Vereinnahmte Entgelte\",IF(ISNUMBER(F6),IF(YEAR(F6)<Stammdaten!$AE$28,1,IF(YEAR(F6)>Stammdaten!$AE$28,12,MONTH(F6))),\"\"),\"\")","v":2},"Einnahmen UST-pfl.",{"v":1250,"d":"1,250.00"},{"v":0.19,"d":"19%"},{"v":237.5,"d":"237.50"},{"$f":"+IF(AND(ISNUMBER(I6),ISNUMBER(K6)),I6+K6,\"\")","v":{"v":1487.5,"d":"1,487.50"}},null,{"$f":"+IF(Stammdaten!$AE$30=\"1 - Ja\",Einnahmen!I6,Einnahmen!L6)","v":{"v":1250,"d":"1,250.00"}},{"$f":"+IF(Stammdaten!$AE$30=\"1 - Ja\",K6,0)","v":{"v":237.5,"d":"237.50"}},null,{"$f":"+IF(AD6=0,\"\",\"Eingaben unvollständig\")","v":""},{"$nulls":3},1,1,1,1,1,null,{"$f":"+SUM(U6:Z6)","v":5},{"$f":"+$AB$3","v":5},{"$f":"+IF(AA6=AB6,1,0)","v":1},{"$f":"+IF(AND(AA6>0,AC6=0),1,0)","v":0}]
[null,"3",{"$f":"IF(H7=\"\",\"\",VLOOKUP(H7,Steuerung!$E$11:$G$17,3,FALSE))","v":"15"},"2024-03-30",{"$f":"IF(Stammdaten!$AE$29=\"2 - Vereinbarte Entgelte\",IF(ISNUMBER(D7),IF(YEAR(D7)<Stammdaten!$AE$28,1,IF(YEAR(D7)>Stammdaten!$AE$28,12,MONTH(D7))),\"\"),\"\")","v":""},"2024-04-15",{"$f":"IF(Stammdaten!$AE$29=\"1 - Vereinnahmte Entgelte\",IF(ISNUMBER(F7),IF(YEAR(F7)<Stammdaten!$AE$28,1,IF(YEAR(F7)>Stammdaten!$AE$28,12,MONTH(F7))),\"\"),\"\")","v":4},"Einnahmen UST-pfl.",{"v":1750,"d":"1,750.00"},{"v":0.19,"d":"19%"},{"v":332.5,"d":"332.50"},{"v":2082.5,"d":"2,082.50"},null,{"$f":"+IF(Stammdaten!$AE$30=\"1 - Ja\",Einnahmen!I7,Einnahmen!L7)","v":{"v":1750,"d":"1,750.00"}},{"$f":"+IF(Stammdaten!$AE$30=\"1 - Ja\",K7,0)","v":{"v":332.5,"d":"332.50"}},null,"",{"$nulls":3},1,1,1,1,1,null,5,5,1,0]
[null,"4",{"$f":"IF(H8=\"\",\"\",VLOOKUP(H8,Steuerung!$E$11:$G$17,3,FALSE))","v":"15"},"2024-05-30",{"$f":"IF(Stammdaten!$AE$29=\"2 - Vereinbarte Entgelte\",IF(ISNUMBER(D8),IF(YEAR(D8)<Stammdaten!$AE$28,1,IF(YEAR(D8)>Stammdaten!$AE$28,12,MONTH(D8))),\"\"),\"\")","v":""},"2024-06-30",{"$f":"IF(Stammdaten!$AE$29=\"1 - Vereinnahmte Entgelte\",IF(ISNUMBER(F8),IF(YEAR(F8)<Stammdaten!$AE$28,1,IF(YEAR(F8)>Stammdaten!$AE$28,12,MONTH(F8))),\"\"),\"\")","v":6},"Einnahmen UST-pfl.",{"v":800,"d":"800.00"},{"v":0.19,"d":"19%"},{"v":152,"d":"152.00"},{"v":952,"d":"952.00"},null,{"$f":"+IF(Stammdaten!$AE$30=\"1 - Ja\",Einnahmen!I8,Einnahmen!L8)","v":{"v":800,"d":"800.00"}},{"$f":"+IF(Stammdaten!$AE$30=\"1 - Ja\",K8,0)","v":{"v":152,"d":"152.00"}},null,"",{"$nulls":3},1,1,1,1,1,null,5,5,1,0]
{"$rows_left_out":197}
{"sheet":"Ausgaben","index":3,"n_rows":204,"n_cols":30,"rows_kept":204}
[]
[]
[null,"1",{"$f":"1+B3","v":2},3,4,5,6,7,8,9,10,11,12,13,14,{"$nulls":12},5]
[null,"Rng-Nr.","Zeile","Rng.-Datum","Monat","Zahl-Datum","Monat","Einnahme.Art","Netto-Betrag","USt%","USt","Brutto-Betrag","Bemerkung","Übergabe_EÜR","Übergabe_EÜR_UST",null,"Hinweis",{"$nulls":3},{"$f":"+B3","v":"1"},{"$f":"+D3","v":3},{"$f":"+H3","v":7},{"$f":"+L3","v":11},{"$f":"+F3","v":5},null,"∑1","∑2","OK","BF"]
[null,"1",{"$f":"IF(H5=\"\",\"\",VLOOKUP(H5,Steuerung!$E$26:$G$49,3,FALSE))","v":"29"},"2023-12-31",{"$f":"IF(Stammdaten!$AE$29=\"2 - Vereinbarte Entgelte\",IF(ISNUMBER(D5),IF(YEAR(D5)<Stammdaten!$AE$28,1,IF(YEAR(D5)>Stammdaten!$AE$28,12,MONTH(D5))),\"\"),\"\")","v":""},"2025-01-13",{"$f":"IF(Stammdaten!$AE$29=\"1 - Vereinnahmte Entgelte\",IF(ISNUMBER(F5),IF(YEAR(F5)<Stammdaten!$AE$28,1,IF(YEAR(F5)>Stammdaten!$AE$28,12,MONTH(F5))),\"\"),\"\")","v":12},"Fremdleistung",{"v":750,"d":"750.00"},{"v":0.19,"d":"19%"},{"$f":"+IF(AND(ISNUMBER(I5),ISNUMBER(J5)),ROUND(I5*J5,2),\"\")","v":{"v":142.5,"d":"142.50"}},{"$f":"+IF(AND(ISNUMBER(I5),ISNUMBER(K5)),I5+K5,\"\")","v":{"v":892.5,"d":"892.50"}},null,{"$f":"+IF(Stammdaten!$AE$30=\"1 - Ja\",I5,L5)","v":{"v":750,"d":"750.00"}},{"$f":"+IF(Stammdaten!$AE$30=\"1 - Ja\",K5,0)","v":{"v":142.5,"d":"142.50"}},null,{"$f":"+IF(AD5=0,\"\",\"Eingaben unvollständig\")","v":""},{"$nulls":3},{"$f":"+IF(B5=\"\",0,1)","v":1},{"$f":"+IF(ISNUMBER(D5),1,0)","v":1},{"$f":"+IF(H5=\"\",0,1)","v":1},{"$f":"+IF(ISNUMBER(L5),1,0)","v":1},{"$f":"+IF(ISNUMBER(F5),1,0)","v":1},null,{"$f":"+SUM(U5:Z5)","v":5},{"$f":"+$AB$3","v":5},{"$f":"+IF(AA5=AB5,1,0)","v":1},{"$f":"+IF(AND(AA5>0,AC5=0),1,0)","v":0}]
[null,"2",{"$f":"IF(H6=\"\",\"\",VLOOKUP(H6,Steuerung!$E$26:$G$49,3,FALSE))","v":"45"},"2024-02-15",{"$f":"IF(Stammdaten!$AE$29=\"2 - Vereinbarte Entgelte\",IF(ISNUMBER(D6),IF(YEAR(D6)<Stammdaten!$AE$28,1,IF(YEAR(D6)>Stammdaten!$AE$28,12,MONTH(D6))),\"\"),\"\")","v":""},"2024-02-28",{"$f":"IF(Stammdaten!$AE$29=\"1 - Vereinnahmte Entgelte\",IF(ISNUMBER(F6),IF(YEAR(F6)<Stammdaten!$AE$28,1,IF(YEAR(F6)>Stammdaten!$AE$28,12,MONTH(F6))),\"\"),\"\")","v":2},"Fortbildung",{"v":250,"d":"250.00"},{"v":0.19,"d":"19%"},{"v":47.5,"d":"47.50"},{"$f":"+IF(AND(ISNUMBER(I6),ISNUMBER(K6)),I6+K6,\"\")","v":{"v":297.5,"d":"297.50"}},null,{"$f":"+IF(Stammdaten!$AE$30=\"1 - Ja\",I6,L6)","v":{"v":250,"d":"250.00"}},{"$f":"+IF(Stammdaten!$AE$30=\"1 - Ja\",K6,0)","v":{"v":47.5,"d":"47.50"}},null,{"$f":"+IF(AD6=0,\"\",\"Eingaben unvollständig\")","v":""},{"$nulls":3},1,1,1,1,1,null,{"$f":"+SUM(U6:Z6)","v":5},{"$f":"+$AB$3","v":5},{"$f":"+IF(AA6=AB6,1,0)","v":1},{"$f":"+IF(AND(AA6>0,AC6=0),1,0)","v":0}]
[null,"3",{"$f":"IF(H7=\"\",\"\",VLOOKUP(H7,Steuerung!$E$26:$G$49,3,FALSE))","v":"44"},"2024-03-30",{"$f":"IF(Stammdaten!$AE$29=\"2 - Vereinbarte Entgelte\",IF(ISNUMBER(D7),IF(YEAR(D7)<Stammdaten!$AE$28,1,IF(YEAR(D7)>Stammdaten!$AE$28,12,MONTH(D7))),\"\"),\"\")","v":""},"2024-04-15",{"$f":"IF(Stammdaten!$AE$29=\"1 - Vereinnahmte Entgelte\",IF(ISNUMBER(F7),IF(YEAR(F7)<Stammdaten!$AE$28,1,IF(YEAR(F7)>Stammdaten!$AE$28,12,MONTH(F7))),\"\"),\"\")","v":4},"Reisekosten",{"v":100,"d":"100.00"},{"v":0.19,"d":"19%"},{"v":19,"d":"19.00"},{"v":119,"d":"119.00"},null,{"$f":"+IF(Stammdaten!$AE$30=\"1 - Ja\",I7,L7)","v":{"v":100,"d":"100.00"}},{"$f":"+IF(Stammdaten!$AE$30=\"1 - Ja\",K7,0)","v":{"v":19,"d":"19.00"}},null,"",{"$nulls":3},1,1,1,1,1,null,5,5,1,0]
[null,"4",{"$f":"IF(H8=\"\",\"\",VLOOKUP(H8,Steuerung!$E$26:$G$49,3,FALSE))","v":"43"},"2024-05-30",{"$f":"IF(Stammdaten!$AE$29=\"2 - Vereinbarte Entgelte\",IF(ISNUMBER(D8),IF(YEAR(D8)<Stammdaten!$AE$28,1,IF(YEAR(D8)>Stammdaten!$AE$28,12,MONTH(D8))),\"\"),\"\")","v":""},"2024-06-30",{"$f":"IF(Stammdaten!$AE$29=\"1 - Vereinnahmte Entgelte\",IF(ISNUMBER(F8),IF(YEAR(F8)<Stammdaten!$AE$28,1,IF(YEAR(F8)>Stammdaten!$AE$28,12,MONTH(F8))),\"\"),\"\")","v":6},"Kommunikation",{"v":500,"d":"500.00"},{"v":0.19,"d":"19%"},{"v":95,"d":"95.00"},{"v":595,"d":"595.00"},null,{"$f":"+IF(Stammdaten!$AE$30=\"1 - Ja\",I8,L8)","v":{"v":500,"d":"500.00"}},{"$f":"+IF(Stammdaten!$AE$30=\"1 - Ja\",K8,0)","v":{"v":95,"d":"95.00"}},null,"",{"$nulls":3},1,1,1,1,1,null,5,5,1,0]
{"$rows_left_out":197}
{"sheet":"Bewirtungskosten","index":4,"n_rows":204,"n_cols":33,"rows_kept":204}
[]
[]
[null,"1",{"$f":"1+B3","v":2},{"$f":"1+C3","v":3},4,5,6,7,8,9,10,11,{"$f":"1+K3","v":11},{"$f":"1+L3","v":12},{"$f":"1+L3","v":12},{"$f":"1+N3","v":13},{"$f":"1+O3","v":13},14,{"$nulls":12},5]
[null,"Rng-Nr.","Zeile","Rng.-Datum","Monat","Zahl-Datum","Monat","Bewirungskosten - Beschreibung","Netto-Betrag","USt%","USt","Brutto-Betrag","Abzugsf.","Nicht abzugsf.","Bemerkung","EÜR - Nicht abzungsfähig","EÜR - abzugsfähig","Übergabe_EÜR_UST",null,"Hinweis",{"$nulls":3},{"$f":"+B3","v":"1"},{"$f":"+D3","v":3},{"$f":"+H3","v":7},{"$f":"+L3","v":11},{"$f":"+F3","v":5},null,"∑1","∑2","OK","BF"]
[null,"1",{"$f":"IF(H5=\"\",\"\",68)","v":68},"2023-12-31",{"$f":"IF(Stammdaten!$AE$29=\"2 - Vereinbarte Entgelte\",IF(ISNUMBER(D5),IF(YEAR(D5)<Stammdaten!$AE$28,1,IF(YEAR(D5)>Stammdaten!$AE$28,12,MONTH(D5))),\"\"),\"\")","v":""},"2024-01-02",{"$f":"IF(Stammdaten!$AE$29=\"1 - Vereinnahmte Entgelte\",IF(ISNUMBER(F5),IF(YEAR(F5)<Stammdaten!$AE$28,1,IF(YEAR(F5)>Stammdaten!$AE$28,12,MONTH(F5))),\"\"),\"\")","v":1},"Mit Firma Müller im Goldenen Löwen",{"v":100,"d":"100.00"},{"v":0.07,"d":"7%"},{"$f":"+IF(AND(ISNUMBER(I5),ISNUMBER(J5)),ROUND(I5*J5,2),\"\")","v":{"v":7,"d":"7.00"}},{"$f":"+IF(AND(ISNUMBER(I5),ISNUMBER(K5)),I5+K5,\"\")","v":{"v":107,"d":"107.00"}},{"$f":"+IF(AND(ISNUMBER(I5),ISNUMBER(K5)),IF(Stammdaten!$AE$30=\"2 - Nein\",L5-N5,I5-N5),\"\")","v":{"v":70,"d":"70.00"}},{"$f":"+IF(AND(ISNUMBER(J5),ISNUMBER(L5)),IF(Stammdaten!$AE$30=\"2 - Nein\",ROUND(L5*0.3,2),ROUND(I5*0.3,2)),\"\")","v":{"v":30,"d":"30.00"}},null,{"$f":"+N5","v":{"v":30,"d":"30.00"}},{"$f":"+M5","v":{"v":70,"d":"70.00"}},{"$f":"+IF(Stammdaten!$AE$30=\"1 - Ja\",K5,0)","v":{"v":7,"d":"7.00"}},null,{"$f":"+IF(AG5=0,\"\",\"Eingaben unvollständig\")","v":""},{"$nulls":3},{"$f":"+IF(B5=\"\",0,1)","v":1},{"$f":"+IF(ISNUMBER(D5),1,0)","v":1},{"$f":"+IF(H5=\"\",0,1)","v":1},{"$f":"+IF(ISNUMBER(L5),1,0)","v":1},{"$f":"+IF(ISNUMBER(F5),1,0)","v":1},null,{"$f":"+SUM(X5:AC5)","v":5},{"$f":"+$AE$3","v":5},{"$f":"+IF(AD5=AE5,1,0)","v":1},{"$f":"+IF(AND(AD5>0,AF5=0),1,0)","v":0}]
[null,"2",{"$f":"IF(H6=\"\",\"\",68)","v":68},"2024-02-15",{"$f":"IF(Stammdaten!$AE$29=\"2 - Vereinbarte Entgelte\",IF(ISNUMBER(D6),IF(YEAR(D6)<Stammdaten!$AE$28,1,IF(YEAR(D6)>Stammdaten!$AE$28,12,MONTH(D6))),\"\"),\"\")","v":""},"2024-02-28",{"$f":"IF(Stammdaten!$AE$29=\"1 - Vereinnahmte Entgelte\",IF(ISNUMBER(F6),IF(YEAR(F6)<Stammdaten!$AE$28,1,IF(YEAR(F6)>Stammdaten!$AE$28,12,MONTH(F6))),\"\"),\"\")","v":2},"Herr Müller von A-GmbH im Pizza-Hut",{"v":50,"d":"50.00"},{"v":0.19,"d":"19%"},{"v":9.5,"d":"9.50"},{"$f":"+IF(AND(ISNUMBER(I6),ISNUMBER(K6)),I6+K6,\"\")","v":{"v":59.5,"d":"59.50"}},{"$f":"+IF(AND(ISNUMBER(I6),ISNUMBER(K6)),IF(Stammdaten!$AE$30=\"2 - Nein\",L6-N6,I6-N6),\"\")","v":{"v":35,"d":"35.00"}},{"$f":"+IF(AND(ISNUMBER(J6),ISNUMBER(L6)),IF(Stammdaten!$AE$30=\"2 - Nein\",ROUND(L6*0.3,2),ROUND(I6*0.3,2)),\"\")","v":{"v":15,"d":"15.00"}},null,{"$f":"+N6","v":{"v":15,"d":"15.00"}},{"$f":"+M6","v":{"v":35,"d":"35.00"}},{"$f":"+IF(Stammdaten!$AE$30=\"1 - Ja\",K6,0)","v":{"v":9.5,"d":"9.50"}},null,{"$f":"+IF(AG6=0,\"\",\"Eingaben unvollständig\")","v":""},{"$nulls":3},1,1,1,1,1,null,{"$f":"+SUM(X6:AC6)","v":5},{"$f":"+$AE$3","v":5},{"$f":"+IF(AD6=AE6,1,0)","v":1},{"$f":"+IF(AND(AD6>0,AF6=0),1,0)","v":0}]
[null,"3",{"$f":"IF(H7=\"\",\"\",68)","v":68},"2024-03-30",{"$f":"IF(Stammdaten!$AE$29=\"2 - Vereinbarte Entgelte\",IF(ISNUMBER(D7),IF(YEAR(D7)<Stammdaten!$AE$28,1,IF(YEAR(D7)>Stammdaten!$AE$28,12,MONTH(D7))),\"\"),\"\")","v":""},"2024-04-15",{"$f":"IF(Stammdaten!$AE$29=\"1 - Vereinnahmte Entgelte\",IF(ISNUMBER(F7),IF(YEAR(F7)<Stammdaten!$AE$28,1,IF(YEAR(F7)>Stammdaten!$AE$28,12,MONTH(F7))),\"\"),\"\")","v":4},"Pizzabestellung für Präsentation",{"v":100,"d":"100.00"},{"v":0.19,"d":"19%"},{"v":19,"d":"19.00"},{"v":119,"d":"119.00"},{"$f":"+IF(AND(ISNUMBER(I7),ISNUMBER(K7)),IF(Stammdaten!$AE$30=\"2 - Nein\",L7-N7,I7-N7),\"\")","v":{"v":70,"d":"70.00"}},{"$f":"+IF(AND(ISNUMBER(J7),ISNUMBER(L7)),IF(Stammdaten!$AE$30=\"2 - Nein\",ROUND(L7*0.3,2),ROUND(I7*0.3,2)),\"\")","v":{"v":30,"d":"30.00"}},null,{"v":30,"d":"30.00"},{"v":70,"d":"70.00"},{"$f":"+IF(Stammdaten!$AE$30=\"1 - Ja\",K7,0)","v":{"v":19,"d":"19.00"}},null,"",{"$nulls":3},1,1,1,1,1,null,5,5,1,0]
[null,"4",68,"2024-04-01",{"$f":"IF(Stammdaten!$AE$29=\"2 - Vereinbarte Entgelte\",IF(ISNUMBER(D8),IF(YEAR(D8)<Stammdaten!$AE$28,1,IF(YEAR(D8)>Stammdaten!$AE$28,12,MONTH(D8))),\"\"),\"\")","v":""},"2024-04-01",{"$f":"IF(Stammdaten!$AE$29=\"1 - Vereinnahmte Entgelte\",IF(ISNUMBER(F8),IF(YEAR(F8)<Stammdaten!$AE$28,1,IF(YEAR(F8)>Stammdaten!$AE$28,12,MONTH(F8))),\"\"),\"\")","v":4},"Lecker Essen mit Kunden im Bayerischen Löwen",{"v":250,"d":"250.00"},{"v":0.07,"d":"7%"},{"v":17.5,"d":"17.50"},{"v":267.5,"d":"267.50"},{"$f":"+IF(AND(ISNUMBER(I8),ISNUMBER(K8)),IF(Stammdaten!$AE$30=\"2 - Nein\",L8-N8,I8-N8),\"\")","v":{"v":175,"d":"175.00"}},{"$f":"+IF(AND(ISNUMBER(J8),ISNUMBER(L8)),IF(Stammdaten!$AE$30=\"2 - Nein\",ROUND(L8*0.3,2),ROUND(I8*0.3,2)),\"\")","v":{"v":75,"d":"75.00"}},null,{"v":75,"d":"75.00"},{"v":175,"d":"175.00"},{"$f":"+IF(Stammdaten!$AE$30=\"1 - Ja\",K8,0)","v":{"v":17.5,"d":"17.50"}},null,"",{"$nulls":3},1,1,1,1,1,null,5,5,1,0]
{"$rows_left_out":197}
{"sheet":"Anlageverzeichnis Seite 1","index":5,"n_rows":125,"n_cols":72,"rows_kept":125,"merged":[[0,4,0,16],[4,62,5,73],[6,56,9,73],[7,5,7,29],[8,5,8,53],[11,5,12,20],[11,21,12,45],[14,5,15,20],[14,21,15,45],[17,71,17,73],[21,62,21,72],[23,62,23,72],[25,62,25,72],[27,62,27,72],[29,62,29,72],[34,62,34,72],[36,62,36,72],[38,62,38,72],[40,62,40,72],[42,62,42,72],[44,62,44,72],[46,62,46,72],[51,62,51,72],[53,62,53,72],[55,62,55,72],[57,62,57,72],[59,62,59,72],[61,62,61,72],[64,6,64,27],[64,53,64,69],[64,71,64,73],[65,62,65,72],[118,8,119,21],[118,34,118,43],[118,56,119,70]]}
[]
[]
[]
[]
[{"$nulls":62},{"$f":"+IF(Stammdaten!AE28=\"\",YEAR(TODAY()-1),Stammdaten!AE28)","v":2024}]
[]
[{"$nulls":56},"Anlage AVEÜR"]
[{"$nulls":5}," Name/Gesellschaft/Gemeinschaft/Körperschaft"]
{"$rows_left_out":69}
{"sheet":"Anlageverzeichnis Seite 2","index":6,"n_rows":145,"n_cols":63,"rows_kept":145,"merged":[[0,4,0,16],[4,62,5,73],[10,62,10,72],[12,62,12,72],[14,62,14,72],[16,62,16,72],[18,62,18,72],[23,62,23,72],[25,62,25,72],[27,62,27,72],[29,62,29,72],[31,62,31,72],[33,62,33,72],[39,62,39,72],[41,62,41,72],[43,62,43,72],[45,62,45,72],[47,62,47,72],[49,62,49,72],[55,62,55,72],[57,62,57,72],[59,62,59,72],[61,62,61,72],[63,62,63,72],[65,62,65,72],[67,62,67,72],[70,6,70,27],[70,53,70,69],[70,71,70,73],[73,62,73,72],[75,62,75,72],[77,62,77,72],[79,62,79,72],[81,62,81,72],[83,62,83,72],[85,62,85,72],[138,8,139,21],[138,34,138,43],[138,56,139,70]]}
[]
[]
[]
[]
[]
[]
[{"$nulls":5},"Häusliches Arbeitszimmer"]
[]
{"$rows_left_out":87}
{"sheet":"Anlageverzeichnis Seite 3","index":7,"n_rows":142,"n_cols":63,"rows_kept":142,"merged":[[0,4,0,16],[4,62,5,73],[9,62,9,72],[11,62,11,72],[13,62,13,72],[15,62,15,72],[17,62,17,72],[19,62,19,72],[21,62,21,72],[26,6,26,57],[26,62,26,72],[28,6,28,54],[28,62,28,72],[33,62,33,72],[35,62,35,72],[37,62,37,72],[42,62,42,72],[44,62,44,72],[46,62,46,72],[48,62,48,72],[53,62,53,72],[55,62,55,72],[57,62,57,72],[59,62,59,72],[64,62,64,72],[66,62,66,72],[68,62,68,72],[70,62,70,72],[75,62,75,72],[77,62,77,72],[79,62,79,72],[82,4,83,4],[83,6,83,55],[83,62,83,72],[135,8,136,21],[135,34,135,43],[135,56,136,70]]}
{"$rows_empty":7}
[{"$nulls":6},"Andere"]
[]
[{"$nulls":4},54,null,"Summe Anschaffungs-/Herstellungskosten/Einlagewerte",{"$nulls":54},420,{"v":900,"d":"900.00"}]
[]
[{"$nulls":4},55,null,"Summe Buchwerte zu Beginn des Gewinnermittlungszeitraums",{"$nulls":54},421,{"v":600,"d":"600.00"}]
[]
[{"$nulls":4},56,null,"Summe Zugänge",{"$nulls":52},422,null,"+"]
{"$rows_left_out":79}
{"sheet":"Anlageverzeichnis Seite 4","index":8,"n_rows":107,"n_cols":63,"rows_kept":107,"merged":[[0,4,0,16],[4,62,5,73],[10,62,10,72],[12,62,12,72],[14,62,14,72],[16,62,16,72],[18,62,18,72],[23,62,23,72],[25,62,25,72],[27,62,27,72],[29,62,29,72],[31,62,31,72],[35,6,35,60],[37,62,37,72],[39,62,39,72],[41,62,41,72],[43,62,43,72],[46,6,46,27],[46,53,46,69],[46,71,46,73],[100,8,101,21],[100,34,100,43],[100,56,101,70]]}
[]
[]
[]
[]
[]
[]
[{"$nulls":5},"Finanzanlagen"]
[]
{"$rows_left_out":45}
{"sheet":"Seite 1","index":9,"n_rows":97,"n_cols":72,"rows_kept":97,"merged":[[0,4,0,16],[4,62,5,73],[6,56,9,73],[7,5,7,29],[8,5,8,53],[10,5,10,9],[11,5,11,53],[13,5,14,20],[13,21,14,45],[18,71,18,73],[20,19,20,34],[20,35,20,38],[20,39,20,45],[20,46,20,60],[20,63,20,72],[22,64,22,73],[23,38,23,40],[25,23,25,72],[27,23,27,72],[29,23,29,24],[29,27,29,72],[30,27,32,72],[31,23,31,24],[34,29,34,32],[36,6,36,27],[36,29,36,32],[38,68,39,70],[38,71,39,73],[40,6,40,27],[40,53,40,69],[40,71,40,73],[41,6,41,48],[41,62,41,72],[43,27,43,30],[43,31,43,40],[46,62,46,72],[49,6,49,48],[49,62,49,72],[51,6,51,47],[51,62,51,72],[53,6,53,48],[53,62,53,72],[56,6,56,48],[56,62,56,72],[58,6,58,48],[58,62,58,72],[60,6,60,48],[60,62,60,72],[62,6,62,48],[62,62,62,72],[64,6,64,48],[64,62,64,72],[67,6,67,48],[67,62,67,72],[70,68,70,70],[70,71,70,73],[71,71,71,73],[72,6,72,47],[72,62,72,72],[74,6,74,47],[74,62,74,72],[76,6,76,47],[76,62,76,72],[78,6,78,47],[78,62,78,72],[88,27,88,49],[88,62,88,72],[90,8,91,21],[90,34,90,43],[90,56,91,70]]}
[]
[]
[]
[]
[{"$nulls":62},{"$f":"+IF(Stammdaten!AE28=\"\",YEAR(TODAY()-1),Stammdaten!AE28)","v":2024}]
[]
[{"$nulls":56},"Anlage EÜR"]
[{"$nulls":5}," Name/Gesellschaft/Gemeinschaft/Körperschaft"]
{"$rows_left_out":82}
{"sheet":"Seite 2","index":10,"n_rows":105,"n_cols":80,"rows_kept":105,"merged":[[0,4,0,16],[4,17,5,39],[6,52,6,68],[6,70,6,72],[7,26,7,58],[7,62,7,71],[10,4,10,48],[10,62,10,71],[12,4,12,48],[12,62,12,71],[15,4,15,50],[16,4,16,48],[16,62,16,71],[18,4,18,48],[18,62,18,71],[20,4,20,48],[20,62,20,71],[22,4,22,48],[22,59,22,61],[22,62,22,71],[24,4,24,48],[24,59,24,61],[24,62,24,71],[26,4,26,48],[26,59,26,61],[26,62,26,71],[28,4,28,48],[28,59,28,61],[28,62,28,71],[30,4,30,48],[30,59,30,61],[30,62,30,71],[33,4,33,46],[35,5,35,47],[35,59,35,61],[35,62,35,71],[37,5,37,47],[37,49,37,51],[37,59,37,61],[37,62,37,71],[39,5,39,47],[39,49,39,51],[39,59,39,61],[39,62,39,71],[40,8,40,27],[40,28,40,30],[40,31,40,40],[43,4,43,46],[44,5,44,48],[44,62,44,71],[46,5,46,47],[46,62,46,71],[48,5,48,47],[48,62,48,71],[50,5,50,47],[50,62,50,71],[52,5,52,47],[52,62,52,71],[54,5,54,47],[54,62,54,71],[56,5,56,47],[56,62,56,71],[58,5,58,47],[58,62,58,71],[60,5,60,47],[60,62,60,71],[62,5,62,47],[62,62,62,71],[64,5,64,47],[64,62,64,71],[66,5,66,47],[66,62,66,71],[68,5,68,47],[68,62,68,71],[70,5,70,47],[70,62,70,71],[72,5,72,47],[72,62,72,71],[74,5,74,47],[74,62,74,71],[76,5,76,47],[76,62,76,71],[78,5,78,47],[78,62,78,71],[95,62,95,71],[98,7,99,20],[98,54,99,68]]}
[]
[]
[]
[]
[{"$nulls":17},{"$f":"+IF(Stammdaten!AE12=\"\",\"\",Stammdaten!AE12)","v":"1232 / 456 / 789"}]
[{"$nulls":79},1]
[{"$nulls":52},"EUR",{"$nulls":17},"Ct"]
[{"$nulls":3},28,{"$nulls":22},"Übertrag (Summe Zeilen 23 bis 27) ",{"$nulls":35},{"$f":"+'Seite 1'!BK89","v":{"v":0,"d":"0.00"}}]
{"$rows_left_out":83}
{"sheet":"Seite 3","index":11,"n_rows":172,"n_cols":64,"rows_kept":172,"merged":[[0,4,0,16],[4,18,5,40],[7,62,7,72],[11,5,11,36],[13,7,13,41],[13,46,13,55],[13,63,13,72],[15,7,15,41],[15,46,15,55],[15,63,15,72],[17,7,17,41],[17,63,17,72],[19,7,19,41],[19,46,19,55],[19,63,19,72],[21,7,21,41],[21,60,21,61],[21,63,21,72],[23,7,23,41],[23,46,23,55],[23,63,23,72],[25,5,25,55],[26,6,26,57],[26,62,26,72],[28,6,28,57],[28,62,28,72],[30,6,30,57],[30,62,30,72],[32,6,32,57],[32,62,32,72],[34,6,34,57],[34,62,34,72],[36,6,36,57],[36,62,36,72],[39,6,39,57],[39,62,39,72],[42,5,42,55],[42,62,42,72],[47,5,47,27],[48,6,48,53],[48,62,48,72],[50,6,50,53],[50,62,50,72],[52,6,52,53],[52,62,52,72],[54,6,54,53],[54,62,54,72],[56,6,56,53],[56,62,56,72],[58,6,58,53],[58,62,58,72],[60,6,60,53],[60,62,60,72],[62,6,62,53],[62,62,62,72],[64,6,64,54],[64,62,64,72],[66,6,66,54],[66,62,66,72],[68,6,68,53],[68,62,68,72],[71,6,71,53],[71,62,71,72],[73,6,73,53],[73,62,73,72],[75,6,75,53],[75,62,75,72],[79,6,79,57],[79,62,79,72],[82,8,83,21],[82,56,83,70],[88,6,91,37],[89,44,89,54],[89,62,89,72],[92,62,92,72],[94,6,94,30],[94,62,94,72],[97,6,97,53],[97,62,97,72],[103,6,103,53],[104,6,104,57],[104,62,104,72],[107,8,108,21],[107,56,108,70]]}
[]
[]
[]
[]
[{"$nulls":18},{"$f":"+IF(Stammdaten!AE12=\"\",\"\",Stammdaten!AE12)","v":"1232 / 456 / 789"}]
[]
[]
[{"$nulls":4},"61",{"$nulls":55},"Übertrag (Summe Zeilen 24 bis 27 und Zeilen 29 bis 60) ",null,{"$f":"+'Seite 2'!BK96","v":{"v":7176.64,"d":"7,176.64"}}]
{"$rows_left_out":80}
{"sheet":"Seite 4","index":12,"n_rows":137,"n_cols":72,"rows_kept":137,"merged":[[0,4,0,16],[4,18,5,40],[7,62,7,72],[10,6,10,53],[10,62,10,72],[13,6,13,53],[13,62,13,72],[16,6,20,35],[16,44,16,54],[16,62,16,72],[18,44,18,54],[18,62,18,72],[21,6,24,37],[22,44,22,54],[22,62,22,72],[25,62,25,72],[27,6,27,30],[27,62,27,72],[30,6,30,53],[30,62,30,72],[39,62,39,72],[40,59,40,73],[41,71,41,73],[42,62,44,72],[43,6,44,38],[48,6,48,38],[48,62,48,72],[50,6,50,44],[50,62,50,72],[52,6,52,38],[52,62,52,72],[55,6,55,38],[55,62,55,72],[60,6,60,38],[60,62,60,72],[62,6,62,38],[62,62,62,72],[65,6,65,38],[65,62,65,72],[69,71,69,73],[71,6,71,46],[73,6,73,57],[73,62,73,72],[75,6,75,57],[75,62,75,72],[130,8,131,21],[130,56,131,70]]}
[]
[]
[]
[]
[{"$nulls":18},{"$f":"+IF(Stammdaten!AE12=\"\",\"\",Stammdaten!AE12)","v":"1232 / 456 / 789"}]
[]
[]
[{"$nulls":4},"90",{"$nulls":54},"Übertrag (Summe/Differenz Zeilen 76 bis 89)",null,null,{"$f":"+'Seite 3'!BK80","v":{"v":10265.38,"d":"10,265.38"}}]
{"$rows_left_out":77}
{"sheet":"UStVA_1","index":13,"n_rows":43,"n_cols":21,"rows_kept":43,"merged":[[3,4,3,22],[7,6,7,8],[7,9,7,11]]}
[]
[]
[]
[{"$nulls":4},"Angaben für die UST-Voranmeldung"]
[]
[]
[]
[{"$nulls":6},"Art der Versteuerung:",null,null,"1 - Vereinnahmte Entgelte"]
{"$rows_left_out":36}
{"sheet":"UStVA_2","index":14,"n_rows":43,"n_cols":21,"rows_kept":43,"merged":[[3,4,3,22],[7,6,7,8],[7,9,7,11]]}
[]
[]
[]
[{"$nulls":4},"Angaben für die UST-Voranmeldung"]
[]
[]
[]
[{"$nulls":6},"Art der Versteuerung:",null,null,"2 - Vereinbarte Entgelte"]
{"$rows_left_out":36}
{"sheet":"Interne Parmeter","index":15,"n_rows":59,"n_cols":5,"rows_kept":59,"hidden":true}
[]
[null,"Ja/Nein"]
[null,"Ja"]
[null,"Nein"]
[]
[null,"Ja/Nein"]
[null,"1 - Ja",1]
[null,"2 - Nein",2]
{"$rows_left_out":51}