{"text_format":"3","workbook":"xlsx","n_sheets":4,"sheets":["Startseite","Berechnung","Hilfe","Parameter_Intern"],"not_rendered":{"images":1,"macros":1,"defined_names":12},"read":"whole","date_system":"1900"}

{"sheet":"Startseite","index":0,"n_rows":41,"n_cols":14,"rows_kept":41,"merged":[[10,6,14,7],[11,12,11,13],[16,3,16,4]]}
[]
[]
[]
[{"$nulls":9},"Startseite"]
[null,"Vergleichsrechner - Finanzierung einer Investition"]
[]
[]
[]
[{"$nulls":3},"Tabellenblätter",{"$nulls":8},"Tabellenblatt",1]
[{"$nulls":6},"Info"]
[{"$nulls":6},{"$f":"INDEX(Parameter_Intern!C5:D6,Startseite!N9,2)","v":"In diesem Tabellenblatt werden die Berechnungen für den Finanzierungsvergleich durchgeführt"},{"$nulls":5},{"$f":"+N9/2","v":0.5},{"$f":"+ROUND(N9/2,0)","v":1}]
[{"$nulls":12},{"$f":"IF(M11=N11,1,2)","v":2}]
[]
[]
[]
[]
[{"$nulls":3},{"$f":"\"Bei einem Klick auf \"&H17&\" kommen Sie direkt zum entsprechenden Arbeitsblatt\"","v":"Bei einem Klick auf Berechnung kommen Sie direkt zum entsprechenden Arbeitsblatt"},{"$nulls":3},{"$f":"+HYPERLINK(VLOOKUP($N$9,Parameter_Intern!$B$5:$E$30,4,FALSE),VLOOKUP($N$9,Parameter_Intern!$B$5:$E$30,2,FALSE))","v":"Berechnung"}]
{"$rows_empty":21}
[null,"© 2023 by mediaforwork - ein Unternehmensbereich der Verlag für die Deutsche Wirtschaft AG"]
[null,"Die Vervielfältigung, Verbreitung oder Veräußerung der Daten oder Texte ist unzulässig und"]
[null,"ausdrücklich nur mit Genehmigung des Verlags gestattet."]

{"sheet":"Berechnung","index":1,"n_rows":81,"n_cols":14,"rows_kept":81,"merged":[[2,1,2,9],[4,2,4,8],[10,2,10,8],[18,2,18,8],[37,2,37,8],[68,2,68,8],[76,7,76,9]]}
[]
[{"$nulls":9},"Berechnung"]
[null,"Vergleichsrechner - Finanzierung einer Investition"]
[]
[null,null,"Allgemeine Eingaben"]
[]
[{"$nulls":3},"Sparzins",null,null,{"v":0.04,"d":"4.00%"}]
[{"$nulls":3},"Durchschnittlicher Kreditzins",null,null,{"v":0.1,"d":"10.00%"}]
[]
[]
[null,null,"Barkauf"]
[]
[{"$nulls":3},"Listenpreis des Fahrzeugs in Euro",null,null,{"v":50000,"d":"50,000.00"}]
[{"$nulls":3},"./. Nachlass beim Händler in Prozent",null,null,{"v":0.25,"d":"25.00%"},{"$f":"G$13*G14","v":{"v":12500,"d":"12,500.00"}}]
[]
[{"$nulls":3},{"$f":"\"Gegenwartswert bei Barkauf in Euro\"","v":"Gegenwartswert bei Barkauf in Euro"},{"$nulls":3},{"$f":"G$13-H14","v":{"v":37500,"d":"37,500.00"}},{"$nulls":5},2]
[]
[]
[null,null,"Leasing"]
[]
[{"$nulls":3},"Sonderzahlung in Euro",null,null,{"v":8000,"d":"8,000.00"},"Euro"]
[{"$nulls":3},"Laufzeit in Monaten",null,null,36,"Monate"]
[{"$nulls":3},"Monatliche  Rate in Euro",null,null,{"v":650,"d":"650.00"},"Euro"]
[{"$nulls":3},"Restwert in Euro",null,null,{"v":22000,"d":"22,000.00"},"Euro "]
[]
[{"$nulls":3},"effektiver Jahreszins (Kredit)",null,null,{"$f":"+G8*100","v":{"v":10,"d":"10.00"}},"Prozent"]
[{"$nulls":3},"Sparzins (Anlage)",null,null,{"$f":"+G7*100","v":{"v":4,"d":"4.00"}},"Prozent"]
[{"$nulls":3},"Mischzins aus Kredit- u. Anlagezins (Ø)",null,null,{"$f":"IF($G27>0,IF($G26>0,($G27+$G26)/2,$G27),$G26)","v":{"v":7,"d":"7.00"}},{"$f":"IF(G28<>\" \",\"Prozent\",\" \")","v":"Prozent"}]
[{"$nulls":3},"Abzinsungsfaktor für Leasing",null,null,{"$f":"IF(G22>0,IF(G23>0,IF(G28>0,((1/((1+($G$28)/100)^($G$22/12))*((1+($G$28)/100)^($G$22/12)-1)/((1+($G$28)/100)^(1/12)-1))*((1+($G$28)/100)^(1/12))),\"Zins!\"),\"Rate!\"),\"Laufzeit!\")","v":32.67351455671731},"(vorschüssig)"]
[{"$nulls":3},"Abzinsungsfaktor für Restwert",null,null,{"$f":"IF(G24>0,(1/((1+($G$28)/100))^($G$22/12)),\"kein Restwert!\")","v":0.8162978768908519}]
[{"$nulls":3},"Barwert der Leasingraten (Monatl. Rate x Faktor für Leasing)",null,null,{"$f":"IF(G29<>\"Laufzeit!\",IF(G29<>\"Rate!\",IF(G29<>\"Zins!\",$G$29*G23,\" \"),\" \"),\" \")","v":21237.78446186625},"Euro"]
[{"$nulls":3},"+ abgezinster Restwert (Restwert x Faktor für Restwert)",null,null,{"$f":"IF(G30<>\"kein Restwert!\",G24*$G$30,\" \")","v":17958.553291598742},{"$f":"IF(G32<>\" \",\"Euro\",\" \")","v":"Euro"}]
[{"$nulls":3},"+ Sonderzahlung von ",null,null,{"$f":"G21","v":8000},"Euro"]
[]
[{"$nulls":3},"= Gegenwartswert bei Leasing",{"$nulls":3},{"$f":"IF(ISERROR(ROUND(IF(G31<>\" \",IF(G32<>\" \",IF(G24>0,IF(G33<>\" \",G31+G33+G32,\" \"),IF(G33<>\" \",G33+G31,\" \")),\" \"),\" \"),2)),\"\",ROUND(IF(G31<>\" \",IF(G32<>\" \",IF(G24>0,IF(G33<>\" \",G31+G33+G32,\" \"),IF(G33<>\" \",G33+G31,\" \")),\" \"),\" \"),2))","v":{"v":47196.34,"d":"47,196.34"}}]
[]
[]
[null,null,"Kauf über Kredit"]
[]
[]
[{"$nulls":3},{"$f":"+IF(N41=1,\"Finanzierung der Anzahlung über Kredit\",\"Keine Finanzierung der Anzahlung über Kredit\")","v":"Finanzierung der Anzahlung über Kredit"},{"$nulls":9},1]
[]
[]
[]
[]
[{"$nulls":3},{"$f":"D13","v":"Listenpreis des Fahrzeugs in Euro"},null,null,{"$f":"G13","v":{"v":50000,"d":"50,000.00"}}]
[]
[{"$nulls":3},"./. Nachlass beim Händler in %",null,null,{"v":0.04,"d":"4.00%"},{"$f":"G$13*G48","v":{"v":2000,"d":"2,000.00"}},{"$nulls":5},{"$f":"+ROUND(G46*G49,2)","v":5000}]
[{"$nulls":3},{"$f":"IF(N41=1,\"./. Anzahlung (in % v. Listenpreis) wird finanziert\",\"./. Anzahlung (in % v. Listenpreis) wird nicht finanziert\")","v":"./. Anzahlung (in % v. Listenpreis) wird finanziert"},null,null,{"v":0.1,"d":"10.00%"},{"$f":"+ROUND(G46*G49,2)","v":{"v":5000,"d":"5,000.00"}}]
[]
[{"$nulls":3},"= zu finanzierender Gesamtbetrag",{"$nulls":3},{"$f":"+IF(N41=1,G46-H48,G46-H48-N48)","v":{"v":48000,"d":"48,000.00"}}]
[]
[{"$nulls":6},"Hauptkredit",{"$f":"+IF(N41=1,\"Für Anzahlung\",\"\")","v":"Für Anzahlung"}]
[{"$nulls":3},"Betrag in Euro",null,null,{"$f":"+G46-H48-N48","v":{"v":43000,"d":"43,000.00"}},{"$f":"IF(N41=1,H49,0)","v":{"v":5000,"d":"5,000.00"}}]
[{"$nulls":3},"Laufzeit in Monaten",null,null,36,{"$f":"+IF(N41=1,G55,0)","v":36}]
[{"$nulls":3},"Effektiver Jahrenszins in %",null,null,{"v":0.05,"d":"5.00%"},{"$f":"+IF(N41=1,G56,0)","v":{"v":0.05,"d":"5.00%"}}]
[{"$nulls":3},"Monatliche Rate in Euro",null,null,{"$f":"IF(ISERROR((G54)/((1/(((1+$G$56))^(($G$55)/12)))*((((1+$G$56))^(($G$55)/12))-1)/((((1+$G$56))^(1/12))-1))),0,(G54)/((1/(((1+$G$56))^(($G$55)/12)))*((((1+$G$56))^(($G$55)/12))-1)/((((1+$G$56))^(1/12))-1)))","v":{"v":1286.6057061822341,"d":"1,286.61"}},{"$f":"IF(N41<>1,0,IF($H$49>0,IF($H$56>0,($H$49)/((1/(((1+$H$56))^($H$55/12)))*((((1+$H$56))^($H$55/12))-1)/((((1+$H$56))^(1/12))-1)),\" \"),0))","v":{"v":149.6053146723528,"d":"149.61"}}]
[]
[{"$nulls":3},"Sparzins (Anlage)",null,null,{"$f":"G7","v":{"v":0.04,"d":"4.00%"}},{"$f":"G7","v":{"v":0.04,"d":"4.00%"}}]
[{"$nulls":3},"Diskontierungszinssatz",null,null,{"$f":"($G59+$G56)/2","v":{"v":0.045,"d":"4.50%"}},{"$f":"(SUM(H59,H56))/2","v":{"v":0.045,"d":"4.50%"}}]
[{"$nulls":3},"Abzinsungsfaktor für Ø-Monatsrate der Finanzierung",null,null,{"$f":"(1/(((1+$G$60))^($G$55/12)))*(((1+$G$60))^(($G$55/12))-1)/((((1+$G$60))^(1/12))-1)","v":33.66253388009325},{"$f":"IF($H$55>0,IF($H$49>0,IF(H60=\" \",0,(1/(((1+H60))^($H$55/12)))*((((1+H60))^($H$55/12))-1)/((((1+H60))^(1/12))-1)),0),0)","v":33.66253388009325}]
[{"$nulls":3},"Barwert der Finanzierung (Monatl. Rate x Faktor für Finanzierung)",null,null,{"$f":"$G$57*$G$61","v":43310.40817468076},{"$f":"H61*H57","v":5036.093973800088}]
[{"$nulls":3},"Summe Barwerte",null,null,{"$f":"IF(G62<>\" \",IF(H62<>\" \",G62+H62,\" \"),\" \")","v":48346.502148480846}]
[{"$nulls":3},"+ eingesetztes Eigenkapital",null,null,{"$f":"+IF(N41=2,N48,0)","v":0}]
[]
[{"$nulls":3},"= Gegenwartswert bei Kreditkauf",{"$nulls":3},{"$f":"IF(ISERROR(IF(G62<>\" \",IF(G62<>\"Rate!\",IF(G62<>\"Zins!\",IF(G49>0,IF(H62<>\" \",G62+H62+G64,\" \"),G62+G64),\" \"),\" \"),\" \")),\"\",IF(G62<>\" \",IF(G62<>\"Rate!\",IF(G62<>\"Zins!\",IF(G49>0,IF(H62<>\" \",G62+H62+G64,\" \"),G62+G64),\" \"),\" \"),\" \"))","v":{"v":48346.502148480846,"d":"48,346.50"}}]
[]
[]
[null,null,"Zusammenfassung und Ergebnisse"]
[]
[{"$nulls":3},"Gegenwartswert bei Barkauf",null,null,{"$f":"+H16","v":{"v":37500,"d":"37,500.00"}},{"$f":"+IF(G71=MAX($G$71:$G$73),\"Teuerste Finanzierung\",IF(G71=MIN($G$71:$G$73),\"Günstigste Finanzierung\",\"\"))","v":"Günstigste Finanzierung"}]
[{"$nulls":3},"Gegenwartswert bei Leasing",null,null,{"$f":"+H35","v":{"v":47196.34,"d":"47,196.34"}},{"$f":"+IF(G72=MAX($G$71:$G$73),\"Teuerste Finanzierung\",IF(G72=MIN($G$71:$G$73),\"Günstigste Finanzierung\",\"\"))","v":""}]
[{"$nulls":3},"Gegenwartswert bei Kreditkauf",null,null,{"$f":"+H66","v":{"v":48346.502148480846,"d":"48,346.50"}},{"$f":"+IF(G73=MAX($G$71:$G$73),\"Teuerste Finanzierung\",IF(G73=MIN($G$71:$G$73),\"Günstigste Finanzierung\",\"\"))","v":"Teuerste Finanzierung"}]
[]
[]
[]
[{"$nulls":3},"<< Startseite",{"$nulls":3},"Hilfe?"]
[]
[null,"© 2023 by mediaforwork - ein Unternehmensbereich der Verlag für die Deutsche Wirtschaft AG"]
[null,"Die Vervielfältigung, Verbreitung oder Veräußerung der Daten oder Texte ist unzulässig und"]
[null,"ausdrücklich nur mit Genehmigung des Verlags gestattet."]

{"sheet":"Hilfe","index":2,"n_rows":19,"n_cols":6,"rows_kept":19,"merged":[[2,1,2,5],[14,1,14,3]]}
[]
[{"$nulls":5},"Hilfe"]
[null,"Vergleichsrechner - Finanzierung einer Investition - Hilfe"]
[]
[{"$nulls":3},"Allgemeine Hinweise"]
[]
[]
[]
[{"$nulls":3},"Hinweise zu den Eingaben"]
[]
[]
[]
[]
[]
[null,"<< Startseite"]
[]
[null,"© 2023 by mediaforwork - ein Unternehmensbereich der Verlag für die Deutsche Wirtschaft AG"]
[null,"Die Vervielfältigung, Verbreitung oder Veräußerung der Daten oder Texte ist unzulässig und"]
[null,"ausdrücklich nur mit Genehmigung des Verlags gestattet."]

{"sheet":"Parameter_Intern","index":3,"n_rows":35,"n_cols":5,"rows_kept":35,"hidden":true}
[]
[]
[]
[null,"Nr","Tabellenblatt","Hinweise","Hyperlink"]
[null,1,"Berechnung","In diesem Tabellenblatt werden die Berechnungen für den Finanzierungsvergleich durchgeführt","#Berechnung!B3"]
[null,2,"Hilfe","Hier finden Sie nähere Informationen über die Anwendung.","#Hilfe!B3"]
{"$rows_empty":26}
[null,"© 2011 by BWRmed!a - ein Unternehmensbereich der Verlag für die Deutsche Wirtschaft AG"]
[null,"Die Vervielfältigung, Verbreitung oder Veräußerung der Daten oder Texte ist unzulässig und"]
[null,"ausdrücklich nur mit Genehmigung des Verlags gestattet."]