{"text_format":"3","workbook":"xlsx","n_sheets":7,"sheets":["Startseite","Eingaben","Berechnung","Beispiel","Hilfe","Parameter_Intern","__Goal_Metadata"],"not_rendered":{"images":5,"macros":1,"defined_names":22},"read":"whole","date_system":"1900"}

{"sheet":"Startseite","index":0,"n_rows":42,"n_cols":14,"rows_kept":42,"merged":[[10,6,14,7],[11,12,11,13],[16,3,16,4]]}
[]
[]
[]
[{"$nulls":9},"Startseite"]
[null,"Minijobrechner 2025"]
[]
[]
[]
[{"$nulls":3},"Tabellenblätter",{"$nulls":8},"Tabellenblatt",1]
[{"$nulls":6},"Info"]
[{"$nulls":6},{"$f":"INDEX(Parameter_Intern!C5:D8,Startseite!N9,2)","v":"Hier machen Sie die Angaben für den Minijobrechner"},{"$nulls":5},{"$f":"+N9/2","v":0.5},{"$f":"+ROUND(N9/2,0)","v":1}]
[{"$nulls":12},{"$f":"IF(M11=N11,1,2)","v":2}]
[]
[]
[]
[]
[{"$nulls":3},{"$f":"\"Bei einem Klick auf \"&H17&\" kommen Sie direkt zum entsprechenden Arbeitsblatt\"","v":"Bei einem Klick auf Eingaben kommen Sie direkt zum entsprechenden Arbeitsblatt"},{"$nulls":3},{"$f":"+HYPERLINK(VLOOKUP($N$9,Parameter_Intern!$B$5:$E$30,4,FALSE),VLOOKUP($N$9,Parameter_Intern!$B$5:$E$30,2,FALSE))","v":"Eingaben"}]
{"$rows_empty":22}
[null,"© 2025 by mediaforwork - ein Unternehmensbereich der Verlag für die Deutsche Wirtschaft AG"]
[null,"Die Vervielfältigung, Verbreitung oder Veräußerung der Daten oder Texte ist unzulässig und"]
[null,"ausdrücklich nur mit Genehmigung des Verlags gestattet."]

{"sheet":"Eingaben","index":1,"n_rows":55,"n_cols":19,"rows_kept":55,"merged":[[2,1,2,13],[4,6,4,7],[15,1,15,4],[22,1,22,13]]}
[]
[{"$nulls":13},"Eingaben"]
[null,"Minijobrechner 2025 - Eingaben"]
[]
[{"$nulls":4},"Name des Mitarbeiters"]
[]
[{"$nulls":4},"Arbeitslohn in Euro (bis maximal 556,00 Euro)",{"$nulls":6},{"$f":"+IF(ISNUMBER(H7),\"\",\"Wert eingeben\")","v":"Wert eingeben"}]
[]
[{"$nulls":4},"Mitarbeiter gesetzlich krankenversicht?"]
[]
[{"$nulls":4},"Umlage U1"]
[]
[{"$nulls":4},"Option zur Rentenversicherungspflicht ausgeübt",{"$nulls":6},{"$f":"+IF(H13=\"\",\"Wert eingeben\",\"\")","v":"Wert eingeben"},{"$nulls":3},{"$f":"+IF(H13=\"Ja\",H13,\"Nein\")","v":"Nein"}]
[]
[]
[null,"<< Startseite",{"$nulls":3},"Beispiel","Hilfe?"]
[]
[null,"© 2025 by mediaforwork - ein Unternehmensbereich der Verlag für die Deutsche Wirtschaft AG"]
[null,"Die Vervielfältigung, Verbreitung oder Veräußerung der Daten oder Texte ist unzulässig und"]
[null,"ausdrücklich nur mit Genehmigung des Verlags gestattet."]
[]
[]
[null,"Berechnungen",{"$nulls":16},"<<-- Ausblenden"]
[]
[]
[{"$nulls":3},"Arbeitslohn",null,{"$f":"+H7","v":{"v":0,"d":"0.00"}}]
[]
[{"$nulls":3},"Rentenversicherung",null,{"v":0.186,"d":"18.600%"},null,{"v":0.036,"d":"3.600%"}]
[]
[{"$nulls":3},"Lohnsteuer",null,{"v":0.02,"d":"2.000%"}]
[]
[{"$nulls":3},"Sozialversicherung",null,"Gesamt","AG","AN"]
[{"$nulls":4},"Krankenversicherung",{"$f":"SUM(G33:H33)","v":{"v":0,"d":"0.000%"}},{"$f":"+IF(H9=\"Ja\",13%,0)","v":{"v":0,"d":"0.000%"}}]
[{"$nulls":4},"Pflegeversicherung",{"$f":"SUM(G34:H34)","v":{"v":0,"d":"0.000%"}},{"v":0,"d":"0.000%"}]
[{"$nulls":4},"Rentenversicherung",{"$f":"SUM(G35:H35)","v":{"v":0.15,"d":"15.000%"}},{"v":0.15,"d":"15.000%"},{"$f":"+IF(P13=\"Nein\",0,H28)","v":{"v":0,"d":"0.000%"}}]
[{"$nulls":4},"Arbeitslosenversicherung",{"$f":"SUM(G36:H36)","v":{"v":0,"d":"0.000%"}},{"v":0,"d":"0.000%"}]
[]
[]
[{"$nulls":4},"Umlage U1",{"$f":"+IF(H11=\"Nein\",0,1.1%)","v":{"v":0.011000000000000001,"d":"1.10%"}}]
[{"$nulls":4},"Umlage U2",{"v":0.0024,"d":"0.24%"}]
[{"$nulls":4},"Insolvenzgeldumlage",{"v":1.5E-3,"d":"0.15%"}]
[{"$nulls":4},"Unfallversicherung",{"v":0.013,"d":"1.30%"}]
[]
[{"$nulls":3},"Berechnung SozVers.",null,"Gesamt","AG","AN"]
[{"$nulls":4},"Krankenversicherung",{"$f":"SUM(G45:H45)","v":{"v":0,"d":"0.00"}},{"$f":"+ROUND(G33*$F$26,2)","v":{"v":0,"d":"0.00"}},{"v":0,"d":"0.00"}]
[{"$nulls":4},"Pflegeversicherung",{"$f":"SUM(G46:H46)","v":{"v":0,"d":"0.00"}},{"v":0,"d":"0.00"},{"v":0,"d":"0.00"}]
[{"$nulls":4},"Rentenversicherung",{"$f":"SUM(G47:H47)","v":{"v":0,"d":"0.00"}},{"$f":"IF(ISNUMBER(H7),ROUND(G35*$F$26,2),0)","v":{"v":0,"d":"0.00"}},{"$f":"IF(ISNUMBER(H7),IF(H7>175,ROUND(H35*$F$26,2),ROUND(175*F28-G47,2)),0)","v":{"v":0,"d":"0.00"}}]
[{"$nulls":4},"Arbeitslosenversicherung",null,{"$f":"ROUND($F$26*G36,2)","v":{"v":0,"d":"0.00"}},{"$f":"+F48-G48","v":{"v":0,"d":"0.00"}}]
[]
[{"$nulls":4},"Lohnsteuer",{"$f":"SUM(G50:H50)","v":{"v":0,"d":"0.00"}},{"$f":"+ROUND(F30*$F$26,2)","v":{"v":0,"d":"0.00"}}]
[]
[{"$nulls":4},"Umlage U1",{"$f":"+G52","v":{"v":0,"d":"0.00"}},{"$f":"+ROUND(F39*H7,2)","v":{"v":0,"d":"0.00"}},{"v":0,"d":"0.00"}]
[{"$nulls":4},"Umlage U2",{"v":0,"d":"0.00"},{"$f":"+ROUND(F40*H7,2)","v":{"v":0,"d":"0.00"}},{"v":0,"d":"0.00"}]
[{"$nulls":4},"Insolvenzgeldumlage",{"$f":"+G54","v":{"v":0,"d":"0.00"}},{"$f":"+ROUND(F41*H7,2)","v":{"v":0,"d":"0.00"}},{"v":0,"d":"0.00"}]
[{"$nulls":4},"Unfallversicherung",{"$f":"+G55","v":{"v":0,"d":"0.00"}},{"$f":"+ROUND(F42*H7,2)","v":{"v":0,"d":"0.00"}},{"v":0,"d":"0.00"}]

{"sheet":"Berechnung","index":2,"n_rows":27,"n_cols":13,"rows_kept":27,"merged":[[2,1,2,12],[22,1,22,3]]}
[]
[{"$nulls":12},"Berechnung"]
[null,"Minijobrechner 2025 - Berechnung"]
[]
[{"$nulls":3},{"$f":"+\"Arbeitsentgelt von \"&Eingaben!G5","v":"Arbeitsentgelt von "},{"$nulls":3},{"$f":"+Eingaben!H7","v":{"v":0,"d":"0.00 €"}}]
[]
[{"$nulls":5},"Summe","AG","AN"]
[{"$nulls":3},"Krankenversicherung",{"$f":"+Eingaben!F33","v":{"v":0,"d":"0.000%"}},{"$f":"+H8+G8","v":{"v":0,"d":"0.00 €"}},{"$f":"+Eingaben!G45","v":{"v":0,"d":"0.00 €"}},{"$f":"+Eingaben!H45","v":{"v":0,"d":"0.00 €"}}]
[{"$nulls":3},"Rentenversicherung 1)",{"$f":"+Eingaben!F35","v":{"v":0.15,"d":"15.000%"}},{"$f":"+H9+G9","v":{"v":0,"d":"0.00 €"}},{"$f":"+Eingaben!G47","v":{"v":0,"d":"0.00 €"}},{"$f":"+Eingaben!H47","v":{"v":0,"d":"0.00 €"}}]
[{"$nulls":3},"Pauschalsteuer",{"$f":"+Eingaben!F30","v":{"v":0.02,"d":"2.000%"}},{"$f":"+H10+G10","v":{"v":0,"d":"0.00 €"}},{"$f":"+Eingaben!G50","v":{"v":0,"d":"0.00 €"}},{"$f":"+Eingaben!H48","v":{"v":0,"d":"0.00 €"}}]
[{"$nulls":3},"Umlage U1",{"$f":"+Eingaben!F39","v":{"v":0.011000000000000001,"d":"1.100%"}},{"$f":"+H11+G11","v":{"v":0,"d":"0.00 €"}},{"$f":"+Eingaben!G52","v":{"v":0,"d":"0.00 €"}},{"$f":"+Eingaben!H52","v":{"v":0,"d":"0.00 €"}}]
[{"$nulls":3},"Umlage U2",{"$f":"+Eingaben!F40","v":{"v":0.0024,"d":"0.240%"}},{"v":0,"d":"0.00 €"},{"$f":"+Eingaben!G53","v":{"v":0,"d":"0.00 €"}},{"$f":"+Eingaben!H53","v":{"v":0,"d":"0.00 €"}}]
[{"$nulls":3},"Insovlenzgeldumlage",{"$f":"+Eingaben!F41","v":{"v":1.5E-3,"d":"0.150%"}},{"v":0,"d":"0.00 €"},{"$f":"+Eingaben!G54","v":{"v":0,"d":"0.00 €"}},{"$f":"+Eingaben!H54","v":{"v":0,"d":"0.00 €"}}]
[{"$nulls":3},"Unfallversicherung",{"$f":"+Eingaben!F42","v":{"v":0.013,"d":"1.300%"}},{"$f":"+H14+G14","v":{"v":0,"d":"0.00 €"}},{"$f":"+Eingaben!G55","v":{"v":0,"d":"0.00 €"}},{"$f":"+Eingaben!H55","v":{"v":0,"d":"0.00 €"}}]
[]
[{"$nulls":3},{"$f":"+IF(Eingaben!P13=\"Nein\",\"1) Normale Rentenversteuerung\",\"1) Voller Beitragssatz zur Rentenversicherung\")","v":"1) Normale Rentenversteuerung"}]
[]
[{"$nulls":3},"Gesamt",null,{"$f":"SUM(F8:F17)","v":{"v":0,"d":"0.00 €"}},{"$f":"SUM(G8:G17)","v":{"v":0,"d":"0.00 €"}},{"$f":"SUM(H8:H17)","v":{"v":0,"d":"0.00 €"}}]
[]
[{"$nulls":3},"Auszahlung",{"$nulls":3},{"$f":"+H5-H18","v":{"v":0,"d":"0.00 €"}}]
[]
[]
[null,"<< Startseite",null,null,"Beispiel","Hilfe?"]
[]
[null,"© 2025 by mediaforwork - ein Unternehmensbereich der Verlag für die Deutsche Wirtschaft AG"]
[null,"Die Vervielfältigung, Verbreitung oder Veräußerung der Daten oder Texte ist unzulässig und"]
[null,"ausdrücklich nur mit Genehmigung des Verlags gestattet."]

{"sheet":"Beispiel","index":3,"n_rows":50,"n_cols":14,"rows_kept":50,"merged":[[45,1,45,4]]}
[]
[{"$nulls":13},"Beispiel"]
{"$rows_empty":43}
[null,"<< Startseite",{"$nulls":3},"Hilfe?"]
[]
[null,"© 2025 by mediaforwork - ein Unternehmensbereich der Verlag für die Deutsche Wirtschaft AG"]
[null,"Die Vervielfältigung, Verbreitung oder Veräußerung der Daten oder Texte ist unzulässig und"]
[null,"ausdrücklich nur mit Genehmigung des Verlags gestattet."]

{"sheet":"Hilfe","index":4,"n_rows":20,"n_cols":6,"rows_kept":20,"merged":[[2,1,2,5],[15,1,15,3]]}
[]
[{"$nulls":5},"Hilfe"]
[null,"Minijobrechner 2025 - Hilfe"]
[]
[{"$nulls":3},"Allgemeine Hinweise"]
[]
[]
[]
[{"$nulls":3},"Hinweise zum Minijobrechner"]
[]
[]
[]
[]
[]
[]
[null,"<< Starseite"]
[]
[null,"© 2025 by mediaforwork - ein Unternehmensbereich der Verlag für die Deutsche Wirtschaft AG"]
[null,"Die Vervielfältigung, Verbreitung oder Veräußerung der Daten oder Texte ist unzulässig und"]
[null,"ausdrücklich nur mit Genehmigung des Verlags gestattet."]

{"sheet":"Parameter_Intern","index":5,"n_rows":35,"n_cols":5,"rows_kept":35,"hidden":true}
[]
[]
[]
[null,"Nr","Tabellenblatt","Hinweise","Hyperlink"]
[null,1,"Eingaben","Hier machen Sie die Angaben für den Minijobrechner","#Eingaben!B3"]
[null,2,"Berechnung","Hier wird die Abrechnung für Ihren Mitarbeiter erstellt","#Berechnung!B3"]
[null,3,"Beispiel","Hier finden Sie ein Beispiel für den Minijobrechner","#Beispiel!B3"]
[null,4,"Hilfe","Hier finden Sie nähere Informationen über die Anwendung.","#Hilfe!B3"]
{"$rows_empty":24}
[null,"© BWRmed!a, ein Unternehmensbereich der VNR Verlag für die Deutsche Wirtschaft AG - HRexperten24.de"]
[null,"Die Vervielfältigung, Verbreitung oder Veräußerung der Daten oder Texte ist unzulässig und"]
[null,"ausdrücklich nur mit Genehmigung des Verlags gestattet."]

{"sheet":"__Goal_Metadata","index":6,"n_rows":2,"n_cols":2,"rows_kept":2,"hidden":true}
["_KAW999934","J"]
["_KAW999929","bb6f94e9-3d72-4b2e-87b9-0e4507023c5a"]