{"text_format":"3","workbook":"xlsx","n_sheets":8,"sheets":["Startseite","Eingaben","Berechnung","Beispiel","Hilfe","Rechengrößen","Parameter_Intern","__Goal_Metadata"],"not_rendered":{"charts":1,"images":4,"macros":1,"defined_names":20},"read":"whole","date_system":"1900"}

{"sheet":"Startseite","index":0,"n_rows":41,"n_cols":14,"rows_kept":41,"merged":[[10,6,14,7],[11,12,11,13],[16,3,16,4]]}
[]
[]
[]
[{"$nulls":9},"Startseite"]
[null,"Firmenwagenrechner - Arbeitgeberkosten bei Privatnutzung"]
[]
[]
[]
[{"$nulls":3},"Tabellenblätter",{"$nulls":8},"Tabellenblatt",1]
[{"$nulls":6},"Info"]
[{"$nulls":6},{"$f":"INDEX(Parameter_Intern!C5:D8,Startseite!N9,2)","v":"Hier geben Sie die Daten für den Firmenwagenrechner ein"},{"$nulls":5},{"$f":"+N9/2","v":0.5},{"$f":"+ROUND(N9/2,0)","v":1}]
[{"$nulls":12},{"$f":"IF(M11=N11,1,2)","v":2}]
[]
[]
[]
[]
[{"$nulls":3},{"$f":"\"Bei einem Klick auf \"&H17&\" kommen Sie direkt zum entsprechenden Arbeitsblatt\"","v":"Bei einem Klick auf Eingaben kommen Sie direkt zum entsprechenden Arbeitsblatt"},{"$nulls":3},{"$f":"+HYPERLINK(VLOOKUP($N$9,Parameter_Intern!$B$5:$E$30,4,FALSE),VLOOKUP($N$9,Parameter_Intern!$B$5:$E$30,2,FALSE))","v":"Eingaben"}]
{"$rows_empty":21}
[null,"© 2025 by mediaforwork - ein Unternehmensbereich der Verlag für die Deutsche Wirtschaft AG"]
[null,"Die Vervielfältigung, Verbreitung oder Veräußerung der Daten oder Texte ist unzulässig und"]
[null,"ausdrücklich nur mit Genehmigung des Verlags gestattet."]

{"sheet":"Eingaben","index":1,"n_rows":58,"n_cols":20,"rows_kept":58,"merged":[[2,1,2,9],[6,7,6,8],[8,7,8,8],[41,7,41,8],[51,1,51,3]]}
[]
[{"$nulls":9},"Eingaben"]
[null,"Firmenwagenrechner - Arbeitgeberkosten bei Privatnutzung\n- Eingaben -"]
[]
[null,null,"Eingaben zum Fahrzeug"]
[{"$nulls":15},2,1,null,2,"Wahl"]
[null,null,"Fahrzeug",{"$nulls":12},{"$f":"+IF(H42=\"Alte Bundesländer\",\"West\",\"Ost\")","v":"West"},"Privat","Knapp","Gesetzlich"]
[{"$nulls":15},"Krankenversicherung",{"$f":"IF($P$6<>$Q$6,\"\",IF($P$7=\"West\",Rechengrößen!E11,Rechengrößen!F11))","v":""},{"$f":"IF($P$6<>$R$6,\"\",IF($P$7=\"West\",Rechengrößen!E15,Rechengrößen!F15))","v":""},{"$f":"IF($P$6<>$S$6,\"\",IF($P$7=\"West\",Rechengrößen!E11,Rechengrößen!F11))","v":66150},{"$f":"SUM(Q8:S8)","v":66150}]
[null,null,"Ansatz Bruttolistenverkaufpreis",{"$nulls":12},"Pflegeversicherung",{"$f":"IF($P$6<>$Q$6,\"\",IF($P$7=\"West\",Rechengrößen!E12,Rechengrößen!F12))","v":""},{"$f":"IF($P$6<>$R$6,\"\",IF($P$7=\"West\",Rechengrößen!E15,Rechengrößen!F15))","v":""},{"$f":"IF($P$6<>$S$6,\"\",IF($P$7=\"West\",Rechengrößen!E12,Rechengrößen!F12))","v":66150},{"$f":"SUM(Q9:S9)","v":66150}]
[{"$nulls":15},"Rentenversicherung",{"$f":"IF($P$6<>$Q$6,\"\",IF($P$7=\"West\",Rechengrößen!E13,Rechengrößen!F13))","v":""},{"$f":"IF($P$6<>$R$6,\"\",IF($P$7=\"West\",Rechengrößen!E15,Rechengrößen!F15))","v":""},{"$f":"++IF($P$6<>$S$6,\"\",IF($P$7=\"West\",Rechengrößen!E13,Rechengrößen!F13))","v":96600},{"$f":"SUM(Q10:S10)","v":96600}]
[null,null,"Bruttolistenpreis inkl. USt",{"$nulls":12},"Arbeitslosenversicherung",{"$f":"IF($P$6<>$Q$6,\"\",IF($P$7=\"West\",Rechengrößen!E14,Rechengrößen!F14))","v":""},{"$f":"IF($P$6<>$R$6,\"\",IF($P$7=\"West\",Rechengrößen!E14,Rechengrößen!F14))","v":""},{"$f":"+IF($P$6<>$S$6,\"\",IF($P$7=\"West\",Rechengrößen!E14,Rechengrößen!F14))","v":96600},{"$f":"SUM(Q11:S11)","v":96600}]
[null,null,"Sonderausstattung",{"$nulls":12},"Knappschaft",{"$f":"IF($P$6<>$Q$6,\"\",IF($P$7=\"West\",Rechengrößen!E15,Rechengrößen!F15))","v":""},null,null,{"$f":"SUM(Q12:S12)","v":0}]
[null,null,"Korrigierter Bruttolistenpreis inkl. USt",{"$nulls":4},{"$f":"+H11+H12","v":0}]
[]
[null,null,"Monatliche Leasingrate",{"$nulls":12},{"$f":"+P6","v":2},1,null,2,"Wahl"]
[{"$nulls":15},{"$f":"+P7","v":"West"},"Privat","Knapp","Gesetzlich"]
[null,null,"Laufleistung / Jahr (km)",{"$nulls":12},"Krankenversicherung",null,{"$f":"+IF($P$15<>R$15,\"\",Rechengrößen!E26)","v":""},{"$f":"+IF(P15<>S15,\"\",Rechengrößen!E26)","v":{"v":0.146,"d":"14.60%"}},{"$f":"SUM(Q17:S17)","v":{"v":0.146,"d":"14.60%"}}]
[null,null,"Verbrauch / 100 km",{"$nulls":12},"Krankenversicherung Sonderbeitrag",null,{"$f":"+IF(R17=\"\",\"\",Rechengrößen!E27)","v":""},{"$f":"+IF(S17=\"\",\"\",Rechengrößen!E20)","v":{"v":0.025,"d":"2.50%"}},{"v":0.025,"d":"2.50%"}]
[null,null,"Preis je Liter Treibstoff",{"$nulls":12},"Pflegeversicherung",null,{"$f":"+IF(R17=\"\",\"\",Rechengrößen!E19)","v":""},{"$f":"+IF(S17=\"\",\"\",Rechengrößen!E19)","v":{"v":0.036,"d":"3.60%"}},{"v":0.036,"d":"3.60%"}]
[{"$nulls":15},"Zuschlag Kinderlose",null,{"$f":"+IF(R17=\"\",\"\",Rechengrößen!E20)","v":""},{"$f":"+IF(S17=\"\",\"\",Rechengrößen!E20)","v":{"v":0.025,"d":"2.50%"}},{"v":0.025,"d":"2.50%"}]
[null,null,"Kfz-Steuer",{"$nulls":12},"Rentenversicherung",{"$f":"+IF($P$15<>Q$15,\"\",IF(Q7=\"\",\"\",Rechengrößen!E23))","v":""},{"$f":"+IF(R17=\"\",\"\",Rechengrößen!E24)","v":""},{"$f":"+IF(S17=\"\",\"\",Rechengrößen!E23)","v":{"v":0.186,"d":"18.60%"}},{"v":0.186,"d":"18.60%"}]
[null,null,"Kfz-Versicherung",{"$nulls":12},"Arbeitslosenversicherung",{"$f":"+IF(Q21=\"\",\"\",Rechengrößen!E22)","v":""},{"$f":"+IF(R17=\"\",\"\",Rechengrößen!E22)","v":""},{"$f":"+IF(S17=\"\",\"\",Rechengrößen!E22)","v":{"v":0.026,"d":"2.60%"}},{"v":0.026,"d":"2.60%"}]
[null,null,"Inspektion, Reparaturen p.a"]
[null,null,"Verschleiß (Reifen etc.)",{"$nulls":12},true,{"$f":"+IF(P24=FALSE(),0,1)","v":1},"  Steuerliche Förderung"]
[null,null,"Sonstige Kosten / Jahr"]
[{"$nulls":15},true,{"$f":"+IF(P26=FALSE(),0,1)","v":1},"  Doppelter Haushalt"]
[null,null,"Eingaben zur Ermittlung des geldwerten Vorteils"]
[]
[null,null,{"$f":"IF(Q26=0,\"Entfernung Wohnung / Arbeit (km)\",\"Entfernung dopp. Haush. / Arbeit (km)\")","v":"Entfernung dopp. Haush. / Arbeit (km)"},{"$nulls":12},"Normaler PKW - 100%",{"v":1,"d":"100%"}]
[{"$nulls":15},"E-PKW - 50%",{"v":0.5,"d":"50%"}]
{"$rows_left_out":29}
{"sheet":"Berechnung","index":2,"n_rows":72,"n_cols":28,"rows_kept":72,"merged":[[2,2,2,14],[7,6,7,7],[44,4,44,5],[45,4,45,5],[64,4,64,5]]}
[]
[{"$nulls":15},"Berechnung"]
[null,null,"Firmenwagenrechner - Arbeitgeberkosten bei Privatnutzung\n- Berechnung -"]
[]
[]
[null,null,"Angaben zum Fahrzeug",{"$nulls":7},"Programmparameter"]
[{"$nulls":19},{"$f":"+Eingaben!P6","v":2},1,null,2,"Wahl"]
[null,null,{"$f":"+IF(Eingaben!H9=\"Fahrzeug:\",\"\",\"Fahrzeug - \"&Eingaben!H9)","v":"Fahrzeug - "},{"$nulls":3},{"$f":"+IF(Eingaben!H7=\"\",\"\",Eingaben!H7)","v":""},{"$nulls":3},"Pauschalversteuerung mit",{"$nulls":3},{"v":0.01,"d":"1.00%"},{"$nulls":4},{"$f":"+Eingaben!P7","v":"West"},"Privat","Knapp","Gesetzlich",{"$nulls":3},{"v":0.01,"d":"1.00%"},{"$f":"+ROUND(AA8/2,6)","v":{"v":0.005,"d":"0.500%"}}]
[{"$nulls":19},"Krankenversicherung",{"$f":"IF($T$7<>$U$7,\"\",IF($T$8=\"West\",Rechengrößen!E11,Rechengrößen!F11))","v":""},{"$f":"IF($T$7<>$V$7,\"\",IF($T$8=\"West\",Rechengrößen!E15,Rechengrößen!F15))","v":""},{"$f":"IF($T$7<>$W$7,\"\",IF($T$8=\"West\",Rechengrößen!E11,Rechengrößen!F11))","v":66150},{"$f":"SUM(U9:W9)","v":66150}]
[null,null,"Bruttolistenpreis inkl. USt",{"$nulls":3},{"$f":"+Eingaben!H11","v":0},{"$nulls":3},"Ansatz für Fahrten Wohnung/Arbeit",{"$nulls":3},{"v":0.0003,"d":"0.030%"},{"$nulls":4},"Pflegeversicherung",{"$f":"IF($T$7<>$U$7,\"\",IF($T$8=\"West\",Rechengrößen!E12,Rechengrößen!F12))","v":""},{"$f":"IF($T$7<>$V$7,\"\",IF($T$8=\"West\",Rechengrößen!E15,Rechengrößen!F15))","v":""},{"$f":"IF($T$7<>$W$7,\"\",IF($T$8=\"West\",Rechengrößen!E12,Rechengrößen!F12))","v":66150},{"$f":"SUM(U10:W10)","v":66150}]
[null,null,"Sonderausstattung",{"$nulls":3},{"$f":"+Eingaben!H12","v":0},{"$nulls":3},"Ansatz für Familienheimfahrten",{"$nulls":3},{"v":2e-05,"d":"0.002%"},{"$nulls":4},"Rentenversicherung",{"$f":"IF($T$7<>$U$7,\"\",IF($T$8=\"West\",Rechengrößen!E13,Rechengrößen!F13))","v":""},{"$f":"IF($T$7<>$V$7,\"\",IF($T$8=\"West\",Rechengrößen!E15,Rechengrößen!F15))","v":""},{"$f":"++IF($T$7<>$W$7,\"\",IF($T$8=\"West\",Rechengrößen!E13,Rechengrößen!F13))","v":96600},{"$f":"SUM(U11:W11)","v":96600},null,null,{"v":0.0003,"d":"0.03%"},{"$f":"+ROUND(AA11/2,6)","v":{"v":0.00015,"d":"0.015%"}}]
[null,null,"Korrigierter Bruttolistenpreis inkl. USt",{"$nulls":3},{"$f":"+G11+G10","v":0},{"$nulls":3},"Kilometerpauschale 1 - bis 20 km",{"$nulls":3},{"v":0.3,"d":"0.30"},{"$nulls":4},"Arbeitslosenversicherung",{"$f":"IF($T$7<>$U$7,\"\",IF($T$8=\"West\",Rechengrößen!E14,Rechengrößen!F14))","v":""},{"$f":"IF($T$7<>$V$7,\"\",IF($T$8=\"West\",Rechengrößen!E14,Rechengrößen!F14))","v":""},{"$f":"+IF($T$7<>$W$7,\"\",IF($T$8=\"West\",Rechengrößen!E14,Rechengrößen!F14))","v":96600},{"$f":"SUM(U12:W12)","v":96600},null,null,{"v":2e-05,"d":"0.002%"},{"$f":"+ROUND(AA12/2,6)","v":{"v":1e-05,"d":"0.0010%"}}]
[{"$nulls":10},"Kilometerpauschale 2 - über 20 km",{"$nulls":3},0.38,{"$nulls":4},"Knappschaft",{"$f":"IF($T$7<>$U$7,\"\",IF($T$8=\"West\",Rechengrößen!E15,Rechengrößen!F15))","v":""},null,null,{"$f":"SUM(U13:W13)","v":0},null,null,{"v":0.3,"d":"0.30"},{"$f":"+AA13/2","v":0.15}]
[null,null,"Ansatz Bruttolistenverkaufspreis",{"$nulls":3},{"$f":"ROUND(G12,-2)*U29","v":0}]
[{"$nulls":10},"Ermittlung der Fahrzeugkosten / Jahr"]
[null,null,"Monatliche Leasingrate",{"$nulls":3},{"$f":"+Eingaben!H15","v":0},{"$nulls":12},{"$f":"+T7","v":2},1,null,2,"Wahl"]
[null,null,"Laufleistung / Jahr (km)",{"$nulls":3},{"$f":"+Eingaben!H17","v":0},{"$nulls":3},"Leasingrate",{"$nulls":3},{"$f":"IF(ISERROR(G16*12),\"\",G16*12)","v":0},{"$nulls":4},{"$f":"+Eingaben!P16","v":"West"},"Privat","Knapp","Gesetzlich"]
[null,null,"Verbrauch / 100 km",{"$nulls":3},{"$f":"+Eingaben!H18","v":0},{"$nulls":3},"Treibstoff",{"$nulls":3},{"$f":"IF(ISERROR(ROUND(G17/100*G18*G19,0)),\"\",ROUND(G17/100*G18*G19,0))","v":0},{"$nulls":4},"Krankenversicherung",null,{"$f":"+IF($T$16<>V$16,\"\",Rechengrößen!E26)","v":""},{"$f":"+IF(T16<>W16,\"\",Rechengrößen!E26)","v":{"v":0.146,"d":"14.60%"}},{"$f":"SUM(U18:W18)","v":{"v":0.146,"d":"14.60%"}}]
[null,null,"Preis je Liter Treibstoff",{"$nulls":3},{"$f":"+Eingaben!H19","v":0},{"$nulls":3},"Kfz-Steuer",{"$nulls":3},{"$f":"+G21","v":0},{"$nulls":4},"Krankenversicherung Zusatzbeitrag",null,{"$f":"+IF(V18=\"\",\"\",Rechengrößen!E27)","v":""},{"$f":"+IF(W18=\"\",\"\",Rechengrößen!E20)","v":{"v":0.025,"d":"2.50%"}},{"v":0.025,"d":"2.50%"}]
[{"$nulls":10},"Kfz-Versicherung",{"$nulls":3},{"$f":"+G22","v":0},{"$nulls":4},"Pflegeversicherung",null,{"$f":"+IF(V18=\"\",\"\",Rechengrößen!E19)","v":""},{"$f":"+IF(W18=\"\",\"\",Rechengrößen!E19)","v":{"v":0.036,"d":"3.60%"}},{"v":0.036,"d":"3.60%"}]
[null,null,"Kfz-Steuer",{"$nulls":3},{"$f":"+Eingaben!H21","v":0},{"$nulls":3},"Inspektion, Reparaturen p.a",{"$nulls":3},{"$f":"+G23","v":0},{"$nulls":4},"Zuschlag Kinderlose",null,{"$f":"+IF(V18=\"\",\"\",Rechengrößen!E20)","v":""},{"$f":"+IF(W18=\"\",\"\",Rechengrößen!E20)","v":{"v":0.025,"d":"2.50%"}},{"v":0.025,"d":"2.50%"}]
[null,null,"Kfz-Versicherung",{"$nulls":3},{"$f":"+Eingaben!H22","v":0},{"$nulls":3},"Verschleiß (Reifen etc.)",{"$nulls":3},{"$f":"+G24","v":0},{"$nulls":4},"Rentenversicherung",{"$f":"+IF($T$16<>U$16,\"\",IF(U8=\"\",\"\",Rechengrößen!E23))","v":""},{"$f":"+IF(V18=\"\",\"\",Rechengrößen!E24)","v":""},{"$f":"+IF(W18=\"\",\"\",Rechengrößen!E23)","v":{"v":0.186,"d":"18.60%"}},{"v":0.186,"d":"18.60%"}]
[null,null,"Inspektion, Reparaturen p.a",{"$nulls":3},{"$f":"+Eingaben!H23","v":0},{"$nulls":3},"Sonstige Kosten / Jahr",{"$nulls":3},{"$f":"+G25","v":0},{"$nulls":4},"Arbeitslosenversicherung",{"$f":"+IF(U22=\"\",\"\",Rechengrößen!E22)","v":""},{"$f":"+IF(V18=\"\",\"\",Rechengrößen!E22)","v":""},{"$f":"+IF(W18=\"\",\"\",Rechengrößen!E22)","v":{"v":0.026,"d":"2.60%"}},{"v":0.026,"d":"2.60%"}]
[null,null,"Verschleiß (Reifen etc.)",{"$nulls":3},{"$f":"+Eingaben!H24","v":0}]
[null,null,"Sonstige Kosten / Jahr",{"$nulls":3},{"$f":"+Eingaben!H25","v":0},{"$nulls":3},"Summe relevante Kfz-Kosten",{"$nulls":3},{"$f":"IF(ISERROR(SUM(O17:O23)),\"\",SUM(O17:O23))","v":0},{"$nulls":4},{"$f":"+Eingaben!P24","v":true},{"$f":"+Eingaben!Q33","v":0},"  Steuerliche Förderung"]
[]
[null,null,"Angaben zur Ermittlung des geldwerten Vorteils",{"$nulls":7},"Ermittlung des geldwerten Vorteils",{"$nulls":8},{"$f":"+Eingaben!P26","v":true},{"$f":"+Eingaben!Q26","v":1}," Doppelter Haushalt"]
[]
[null,null,{"$f":"IF(U27=0,\"Entfernung Wohnung / Arbeit (km)\",\"Entfernung dopp. Haush. / Arbeit (km)\")","v":"Entfernung dopp. Haush. / Arbeit (km)"},{"$nulls":3},{"$f":"+Eingaben!H29","v":0},{"$nulls":3},"Geldwerter Vorteil",{"$nulls":3},{"$f":"IF(ISERROR(ROUND(G14*O8*12,0)),\"\",ROUND(G14*O8*12,0))","v":0},{"$nulls":4},"Ansatz Bruttolistenverkaufspreis",{"$f":"+Eingaben!R31","v":{"v":1,"d":"100%"}}]
[{"$nulls":10},"Entfernungspauschale",{"$nulls":3},{"$f":"ROUND(G29*O10*G14*12,0)","v":0}]
{"$rows_left_out":43}
{"sheet":"Beispiel","index":3,"n_rows":60,"n_cols":20,"rows_kept":60,"merged":[[2,1,2,9],[6,7,6,8],[8,7,8,8],[41,7,41,8],[51,1,51,3]]}
[]
[]
[null,"Firmenwagenrechner - Arbeitgeberkosten bei Privatnutzung\n- Beispiel -"]
[]
[null,null,"Eingaben zum Fahrzeug"]
[{"$nulls":15},2,1,null,2,"Wahl"]
[null,null,"Fahrzeug",{"$nulls":4},"Audi A4",{"$nulls":7},{"$f":"+IF(H40=\"Alte Bundesländer\",\"West\",\"Ost\")","v":"Ost"},"Privat","Knapp","Gesetzlich"]
[{"$nulls":15},"Krankenversicherung",{"$f":"IF($P$6<>$Q$6,\"\",IF($P$7=\"West\",Rechengrößen!E11,Rechengrößen!F11))","v":""},{"$f":"IF($P$6<>$R$6,\"\",IF($P$7=\"West\",Rechengrößen!E15,Rechengrößen!F15))","v":""},{"$f":"IF($P$6<>$S$6,\"\",IF($P$7=\"West\",Rechengrößen!E11,Rechengrößen!F11))","v":66150},{"$f":"SUM(Q8:S8)","v":66150}]
[null,null,"Ansatz Bruttolistenverkaufpreis",{"$nulls":4},"E-PKW - 25%",{"$nulls":7},"Pflegeversicherung",{"$f":"IF($P$6<>$Q$6,\"\",IF($P$7=\"West\",Rechengrößen!E12,Rechengrößen!F12))","v":""},{"$f":"IF($P$6<>$R$6,\"\",IF($P$7=\"West\",Rechengrößen!E15,Rechengrößen!F15))","v":""},{"$f":"IF($P$6<>$S$6,\"\",IF($P$7=\"West\",Rechengrößen!E12,Rechengrößen!F12))","v":66150},{"$f":"SUM(Q9:S9)","v":66150}]
[{"$nulls":15},"Rentenversicherung",{"$f":"IF($P$6<>$Q$6,\"\",IF($P$7=\"West\",Rechengrößen!E13,Rechengrößen!F13))","v":""},{"$f":"IF($P$6<>$R$6,\"\",IF($P$7=\"West\",Rechengrößen!E15,Rechengrößen!F15))","v":""},{"$f":"++IF($P$6<>$S$6,\"\",IF($P$7=\"West\",Rechengrößen!E13,Rechengrößen!F13))","v":96600},{"$f":"SUM(Q10:S10)","v":96600}]
[null,null,"Bruttolistenpreis inkl. USt",{"$nulls":4},{"v":37500,"d":"37,500 €"},{"$nulls":7},"Arbeitslosenversicherung",{"$f":"IF($P$6<>$Q$6,\"\",IF($P$7=\"West\",Rechengrößen!E14,Rechengrößen!F14))","v":""},{"$f":"IF($P$6<>$R$6,\"\",IF($P$7=\"West\",Rechengrößen!E14,Rechengrößen!F14))","v":""},{"$f":"+IF($P$6<>$S$6,\"\",IF($P$7=\"West\",Rechengrößen!E14,Rechengrößen!F14))","v":96600},{"$f":"SUM(Q11:S11)","v":96600}]
[null,null,"Sonderausstattung",{"$nulls":4},{"v":2546,"d":"2,546 €"},{"$nulls":7},"Knappschaft",{"$f":"IF($P$6<>$Q$6,\"\",IF($P$7=\"West\",Rechengrößen!E15,Rechengrößen!F15))","v":""},null,null,{"$f":"SUM(Q12:S12)","v":0}]
[null,null,"Korrigierter Bruttolistenpreis inkl. USt",{"$nulls":4},{"$f":"+H11+H12","v":{"v":40046,"d":"40,046"}}]
[]
[null,null,"Monatliche Leasingrate",{"$nulls":4},{"v":750,"d":"750 €"},{"$nulls":7},{"$f":"+P6","v":2},1,null,2,"Wahl"]
[{"$nulls":15},{"$f":"+P7","v":"Ost"},"Privat","Knapp","Gesetzlich"]
[null,null,"Laufleistung / Jahr (km)",{"$nulls":4},{"v":30000,"d":"30,000 km"},{"$nulls":7},"Krankenversicherung",null,{"$f":"+IF($P$15<>R$15,\"\",Rechengrößen!E26)","v":""},{"$f":"+IF(P15<>S15,\"\",Rechengrößen!E26)","v":{"v":0.146,"d":"14.60%"}},{"$f":"SUM(Q17:S17)","v":{"v":0.146,"d":"14.60%"}}]
[null,null,"Verbrauch / 100 km",{"$nulls":4},{"v":9.2,"d":"9.20 L/km"},{"$nulls":7},"Krankenversicherung Sonderbeitrag",null,{"$f":"+IF(R17=\"\",\"\",Rechengrößen!E27)","v":""},{"$f":"+IF(S17=\"\",\"\",Rechengrößen!E20)","v":{"v":0.025,"d":"2.50%"}},{"v":0.025,"d":"2.50%"}]
[null,null,"Preis je Liter Treibstoff",{"$nulls":4},{"v":1.4,"d":"1.40 €/L"},{"$nulls":7},"Pflegeversicherung",null,{"$f":"+IF(R17=\"\",\"\",Rechengrößen!E19)","v":""},{"$f":"+IF(S17=\"\",\"\",Rechengrößen!E19)","v":{"v":0.036,"d":"3.60%"}},{"v":0.036,"d":"3.60%"}]
[{"$nulls":15},"Zuschlag Kinderlose",null,{"$f":"+IF(R17=\"\",\"\",Rechengrößen!E20)","v":""},{"$f":"+IF(S17=\"\",\"\",Rechengrößen!E20)","v":{"v":0.025,"d":"2.50%"}},{"v":0.025,"d":"2.50%"}]
[null,null,"Kfz-Steuer",{"$nulls":4},{"v":750,"d":"750 €"},{"$nulls":7},"Rentenversicherung",{"$f":"+IF($P$15<>Q$15,\"\",IF(Q7=\"\",\"\",Rechengrößen!E23))","v":""},{"$f":"+IF(R17=\"\",\"\",Rechengrößen!E24)","v":""},{"$f":"+IF(S17=\"\",\"\",Rechengrößen!E23)","v":{"v":0.186,"d":"18.60%"}},{"v":0.186,"d":"18.60%"}]
[null,null,"Kfz-Versicherung",{"$nulls":4},{"v":750,"d":"750 €"},{"$nulls":7},"Arbeitslosenversicherung",{"$f":"+IF(Q21=\"\",\"\",Rechengrößen!E22)","v":""},{"$f":"+IF(R17=\"\",\"\",Rechengrößen!E22)","v":""},{"$f":"+IF(S17=\"\",\"\",Rechengrößen!E22)","v":{"v":0.026,"d":"2.60%"}},{"v":0.026,"d":"2.60%"}]
[null,null,"Inspektion, Reparaturen p.a",{"$nulls":4},{"v":1500,"d":"1,500 €"}]
[null,null,"Verschleiß (Reifen etc.)",{"$nulls":4},{"v":1500,"d":"1,500 €"},{"$nulls":7},true]
[null,null,"Sonstige Kosten / Jahr",{"$nulls":4},{"v":2000,"d":"2,000 €"}]
[{"$nulls":15},true,{"$f":"+IF(P26=FALSE(),0,1)","v":1}]
[null,null,"Eingaben zur Ermittlung des geldwerten Vorteils"]
[]
[null,null,{"$f":"IF(Q26=0,\"Entfernung Wohnung / Arbeit (km)\",\"Entfernung dopp. Haush. / Arbeit (km)\")","v":"Entfernung dopp. Haush. / Arbeit (km)"},{"$nulls":4},30]
[]
{"$rows_left_out":31}
{"sheet":"Hilfe","index":4,"n_rows":19,"n_cols":6,"rows_kept":19,"merged":[[2,1,2,5]]}
[]
[{"$nulls":5},"Hilfe"]
[null,"Firmenwagenrechner - Arbeitgeberkosten bei Privatnutzung\n- Hinweise -"]
[]
[{"$nulls":3},"Allgemeine Hinweise"]
[]
[]
[]
[{"$nulls":3},"Hinweise zum Firmenwagenrechner"]
[]
[]
[]
[]
[]
[{"$nulls":3},"Startseite"]
[]
[null,"© 2025 by mediaforwork - ein Unternehmensbereich der Verlag für die Deutsche Wirtschaft AG"]
[null,"Die Vervielfältigung, Verbreitung oder Veräußerung der Daten oder Texte ist unzulässig und"]
[null,"ausdrücklich nur mit Genehmigung des Verlags gestattet."]

{"sheet":"Rechengrößen","index":5,"n_rows":34,"n_cols":18,"rows_kept":34,"hidden":true,"merged":[[2,1,2,10],[4,3,4,4],[8,3,9,3],[8,4,8,5],[8,6,8,7],[8,13,9,13],[8,14,8,15],[8,16,8,17]]}
[]
[]
[null,{"$f":"\"Rechengrößen \"&IF($N$5=P5,$O9,$Q9)","v":"Rechengrößen 2025"}]
[]
[{"$nulls":3},"Sozialversicherung",{"$nulls":9},{"$f":"Eingaben!I40+0","v":0},null,{"$f":"+IF(AND(ISNUMBER(N5),N5=2024),N5-0,2024)","v":2024},null,{"$f":"+IF(AND(ISNUMBER(N5),N5=2025),N5,2025)","v":2025}]
[]
[{"$nulls":3},"Beitragsbemessungsgrenzen"]
[]
[{"$nulls":3},"Beitragsbemessungsgrenzen","Jahr",null,"Monat",{"$nulls":6},"Beitragsbemessungsgrenzen",{"$f":"+P5","v":2024},null,2025]
[{"$nulls":4},"West","Ost","West","Ost",{"$nulls":6},"West","Ost","West","Ost"]
[{"$nulls":3},"Krankenversicherung",{"$f":"+IF($N$5=$P$5,$O11,$Q11)","v":{"v":66150,"d":"66,150.00"}},{"$f":"+IF($N$5=$P$5,$P11,$R11)","v":{"v":66150,"d":"66,150.00"}},{"$f":"IF(ISERROR(ROUND(E11/12,2)),\"\",ROUND(E11/12,2))","v":{"v":5512.5,"d":"5,512.50"}},{"$f":"+ROUND(F11/12,2)","v":{"v":5512.5,"d":"5,512.50"}},{"$nulls":5},"Krankenversicherung",{"v":62100,"d":"62,100.00"},{"v":62100,"d":"62,100.00"},{"v":66150,"d":"66,150.00"},{"v":66150,"d":"66,150.00"}]
[{"$nulls":3},"Pflegeversicherung",{"v":66150,"d":"66,150.00"},{"$f":"+IF($N$5=$P$5,$P12,$R12)","v":{"v":66150,"d":"66,150.00"}},{"$f":"IF(ISERROR(ROUND(E12/12,2)),\"\",ROUND(E12/12,2))","v":{"v":5512.5,"d":"5,512.50"}},{"$f":"+ROUND(F12/12,2)","v":{"v":5512.5,"d":"5,512.50"}},{"$nulls":5},"Pflegeversicherung",{"v":62100,"d":"62,100.00"},{"v":62100,"d":"62,100.00"},{"v":66150,"d":"66,150.00"},{"v":66150,"d":"66,150.00"}]
[{"$nulls":3},"Rentenversicherung",{"v":96600,"d":"96,600.00"},{"v":96600,"d":"96,600.00"},{"$f":"IF(ISERROR(ROUND(E13/12,2)),\"\",ROUND(E13/12,2))","v":{"v":8050,"d":"8,050.00"}},{"$f":"+ROUND(F13/12,2)","v":{"v":8050,"d":"8,050.00"}},{"$nulls":5},"Rentenversicherung",{"v":90600,"d":"90,600.00"},{"v":89400,"d":"89,400.00"},{"v":96600,"d":"96,600.00"},{"v":96600,"d":"96,600.00"}]
[{"$nulls":3},"Arbeitslosenversicherung",{"$f":"+IF($N$5=$P$5,$O14,$Q14)","v":{"v":96600,"d":"96,600.00"}},{"v":96600,"d":"96,600.00"},{"$f":"IF(ISERROR(ROUND(E14/12,2)),\"\",ROUND(E14/12,2))","v":{"v":8050,"d":"8,050.00"}},{"$f":"+ROUND(F14/12,2)","v":{"v":8050,"d":"8,050.00"}},{"$nulls":5},"Arbeitslosenversicherung",{"v":90600,"d":"90,600.00"},{"v":89400,"d":"89,400.00"},{"v":96600,"d":"96,600.00"},{"v":96600,"d":"96,600.00"}]
[{"$nulls":3},"Knappschaft",{"$f":"+IF($N$5=$P$5,$O15,$Q15)","v":{"v":118800,"d":"118,800.00"}},{"v":118800,"d":"118,800.00"},{"$f":"IF(ISERROR(ROUND(E15/12,2)),\"\",ROUND(E15/12,2))","v":{"v":9900,"d":"9,900.00"}},{"$f":"+ROUND(F15/12,2)","v":{"v":9900,"d":"9,900.00"}},{"$nulls":5},"Knappschaft",{"v":111600,"d":"111,600.00"},{"v":110400,"d":"110,400.00"},{"v":118800,"d":"118,800.00"},{"v":118800,"d":"118,800.00"}]
[]
[{"$nulls":3},"Beitragssätze"]
[{"$nulls":14},2024,2025]
[{"$nulls":3},"Pflegeversicherung",{"$f":"+IF($N$5=P5,$O19,$P19)","v":{"v":0.036,"d":"3.60%"}},{"$nulls":8},"Pflegeversicherung",{"v":0.034,"d":"3.40%"},{"v":0.036,"d":"3.60%"},{"$f":"0.5*P19","v":{"v":0.018,"d":"1.8000%"}}]
[{"$nulls":3},"Zuschlag für Kinderlose",{"$f":"+IF($N$5=P5,$O20,$P20)","v":{"v":0.025,"d":"2.50%"}},{"$nulls":8},"Zuschlag für Kinderlose",{"v":0.017,"d":"1.70%"},{"v":0.025,"d":"2.50%"},{"$f":"0.5*P20","v":{"v":0.0125,"d":"1.2500%"}}]
[]
[{"$nulls":3},"Arbeitslosenversicherung",{"$f":"+IF($N$5=P5,$O22,$P22)","v":{"v":0.026,"d":"2.60%"}},{"$nulls":8},"Arbeitslosenversicherung",{"v":0.026,"d":"2.60%"},{"v":0.026,"d":"2.60%"}]
[{"$nulls":3},"Rentenversicherung",{"$f":"+IF($N$5=P5,$O23,$P23)","v":{"v":0.186,"d":"18.60%"}},{"$nulls":8},"Rentenversicherung",{"v":0.186,"d":"18.60%"},{"v":0.186,"d":"18.60%"}]
[{"$nulls":3},"Knappschaft",{"$f":"+IF($N$5=P5,$O24,$P24)","v":{"v":0.247,"d":"24.70%"}},{"$nulls":8},"Knappschaft",{"v":0.247,"d":"24.70%"},{"v":0.247,"d":"24.70%"}]
[]
[{"$nulls":3},"Krankenversicherung",{"$f":"+IF($N$5=P5,$O26,$P26)","v":{"v":0.146,"d":"14.60%"}},{"$nulls":8},"Krankenversicherung",{"v":0.146,"d":"14.60%"},{"v":0.146,"d":"14.60%"},{"$f":"0.5*P26","v":{"v":0.073,"d":"7.3000%"}}]
[{"$nulls":3},"Zusatzbeitrag",{"$f":"+IF($N$5=P5,$O27,$P27)","v":{"v":0.025,"d":"2.50%"}},{"$nulls":8},"Zusatzbeitrag",{"v":0.016,"d":"1.60%"},{"v":0.025,"d":"2.50%"},{"$f":"0.5*P27","v":{"v":0.0125,"d":"1.2500%"}}]
[]
[]
[]
{"$rows_left_out":5}
{"sheet":"Parameter_Intern","index":6,"n_rows":35,"n_cols":5,"rows_kept":35,"hidden":true}
[]
[]
[]
[null,"Nr","Tabellenblatt","Hinweise","Hyperlink"]
[null,1,"Eingaben","Hier geben Sie die Daten für den Firmenwagenrechner ein","#Eingaben!B3"]
[null,2,"Beispiel","Hier finden Sie ein Beispiel für die Eingaben","#Beispiel!B3"]
[null,3,"Berechnung","Hier kommen Sie direkt zu den Berechnungsergebnissen","#Berechnung!B3"]
[null,4,"Hilfe","Hier finden Sie nähere Informationen über die Anwendung.","#Hilfe!B3"]
{"$rows_empty":24}
[null,"© BWRmed!a, ein Unternehmensbereich der VNR Verlag für die Deutsche Wirtschaft AG - HRexperten24.de"]
[null,"Die Vervielfältigung, Verbreitung oder Veräußerung der Daten oder Texte ist unzulässig und"]
[null,"ausdrücklich nur mit Genehmigung des Verlags gestattet."]

{"sheet":"__Goal_Metadata","index":7,"n_rows":2,"n_cols":2,"rows_kept":2,"hidden":true}
["_KAW999934","J"]
["_KAW999929","ae71bcf0-ef7f-449d-816a-e0e542cdad53"]