{"text_format":"3","workbook":"xlsx","n_sheets":11,"sheets":["Startseite","Eingaben","Berechnung","Beispiel","Hilfe","Tabelle pfändbarer Beträge 2024","Tabelle pfändbarer Beträge 2023","Tabelle pfändbarer Beträge 2022","Tabelle pfändbarer Beträge 2021","Tabelle pfändbarer Beträge 2020","Parameter_Intern"],"not_rendered":{"images":5,"macros":1,"defined_names":43},"read":"whole","date_system":"1900"}

{"sheet":"Startseite","index":0,"n_rows":41,"n_cols":14,"rows_kept":41,"merged":[[10,6,14,7],[11,12,11,13],[16,3,16,4]]}
[]
[]
[]
[{"$nulls":9},"Startseite"]
[null,"Lohnpfändungsrechner 2024/2025"]
[]
[]
[]
[{"$nulls":3},"Tabellenblätter",{"$nulls":8},"Tabellenblatt",1]
[{"$nulls":6},"Info"]
[{"$nulls":6},{"$f":"INDEX(Parameter_Intern!C5:D8,Startseite!N9,2)","v":"Hier geben Sie die Daten für den Lohnpfändungsrechner ein"},{"$nulls":5},{"$f":"+N9/2","v":0.5},{"$f":"+ROUND(N9/2,0)","v":1}]
[{"$nulls":12},{"$f":"IF(M11=N11,1,2)","v":2}]
[]
[]
[]
{"$rows_left_out":7}
{"sheet":"Eingaben","index":1,"n_rows":54,"n_cols":16,"rows_kept":54,"merged":[[2,1,2,12],[6,7,6,8],[7,7,7,8],[8,7,8,8],[10,7,10,8],[11,7,11,8],[12,7,12,8],[49,1,49,5]]}
[]
[{"$nulls":12},"Eingaben"]
[null,"Lohnpfändungsrechner 2024/2025 - Eingaben",{"$nulls":13},"Auswahl"]
[{"$nulls":15},"0 Personen"]
[null,null,"Allgemeine Angaben",{"$nulls":12},"1 Person"]
[{"$nulls":15},"2 Personen"]
[{"$nulls":3},"Mitarbeiter",{"$nulls":11},"3 Personen"]
[{"$nulls":3},"Straße",{"$nulls":11},"4 Personen"]
[{"$nulls":3},"PLZ, Ort",{"$nulls":11},"5 Personen oder mehr"]
[]
[{"$nulls":3},"Bank"]
[{"$nulls":3},"Konto"]
[{"$nulls":3},"BLZ"]
[]
[{"$nulls":3},"Unterhaltspflicht für ",{"$nulls":4},2]
{"$rows_left_out":40}
{"sheet":"Berechnung","index":2,"n_rows":73,"n_cols":20,"rows_kept":73,"merged":[[2,1,2,14],[5,11,5,13],[6,11,6,13],[7,11,7,13]]}
[]
[{"$nulls":14},"Berechnung"]
[null,"Lohnpfändungsrechner 2024/2025 - Berechnung",{"$nulls":15},"Auswahl"]
[{"$nulls":17},"0 Personen"]
[{"$nulls":17},"1 Person"]
[{"$nulls":3},"Mitarbeiter",null,null,{"$f":"IF(Eingaben!H7=\"\",\"\",Eingaben!H7)","v":""},null,null,"Bank",null,{"$f":"IF(Eingaben!H11=\"\",\"\",Eingaben!H11)","v":""},{"$nulls":5},"2 Personen"]
[{"$nulls":3},"Straße",null,null,{"$f":"IF(Eingaben!H8=\"\",\"\",Eingaben!H8)","v":""},null,null,"Konto",null,{"$f":"IF(Eingaben!H12=\"\",\"\",Eingaben!H12)","v":""},{"$nulls":5},"3 Personen"]
[{"$nulls":3},"PLZ, Ort",null,null,{"$f":"IF(Eingaben!H9=\"\",\"\",Eingaben!H9)","v":""},null,null,"BLZ",null,{"$f":"IF(Eingaben!H13=\"\",\"\",Eingaben!H13)","v":""},{"$nulls":5},"4 Personen"]
[{"$nulls":17},"5 Personen oder mehr"]
[{"$nulls":3},"Unterhaltspflicht für Anzahl Personen:",{"$nulls":3},{"$f":"Eingaben!I15-1","v":1},null,"Forderungsbetrag",{"$nulls":3},{"$f":"+Eingaben!I17","v":{"v":0,"d":"0.00 €"}}]
[]
[]
[]
[]
[null,null,"1.","Bruttoarbeitseinkommen (§ 850 ZPO)",{"$nulls":5},{"$f":"+Eingaben!K22","v":{"v":0,"d":"0.00 €"}}]
{"$rows_left_out":59}
{"sheet":"Beispiel","index":3,"n_rows":55,"n_cols":16,"rows_kept":55,"merged":[[49,1,49,5]]}
[]
[]
[{"$nulls":15},"Auswahl"]
[{"$nulls":15},"0 Personen"]
[{"$nulls":15},"1 Person"]
[{"$nulls":15},"2 Personen"]
[{"$nulls":15},"3 Personen"]
[{"$nulls":15},"4 Personen"]
[{"$nulls":15},"5 Personen oder mehr"]
{"$rows_empty":40}
[null,"<< Startseite",{"$nulls":4},"Hilfe?"]
[]
[]
[",","© 2024 by mediaforwork - ein Unternehmensbereich der Verlag für die Deutsche Wirtschaft AG"]
[null,"Die Vervielfältigung, Verbreitung oder Veräußerung der Daten oder Texte ist unzulässig und"]
{"$rows_left_out":2}
{"sheet":"Hilfe","index":4,"n_rows":20,"n_cols":6,"rows_kept":20,"merged":[[2,1,2,5]]}
[]
[{"$nulls":5},"Hilfe"]
[null,"Lohnpfändungsrechner 2024/2025 - Hilfe"]
[]
[{"$nulls":3},"Allgemeine Hinweise"]
[]
[]
[]
[{"$nulls":3},"Hinweise zum Berechnungsbogen zur Lohnpfändung"]
[]
[]
[]
[]
[]
[{"$nulls":3},"<< Starseite"]
{"$rows_left_out":6}
{"sheet":"Tabelle pfändbarer Beträge 2024","index":5,"n_rows":316,"n_cols":21,"rows_kept":316,"hidden":true,"merged":[[2,4,2,9],[2,12,2,13],[2,15,2,20],[3,1,3,2],[3,12,3,13]]}
[]
[]
[{"$nulls":4},"Pfändbarer Betrag bei Unterhaltspflicht für ... Personen",{"$nulls":7},"Nettolohn",null,null,"Pfändbarer Betrag bei Unterhaltspflicht für ... Personen\n(gültig vom 01.07.2023 bis 30.06.2024)"]
[null,"Nettolohn",null,null,0,1,2,3,4,5,null,null,"monatlich in Euro",null,null,0,1,2,3,4,5]
[null,"Add. Links","Add. Rechts",{"$nulls":6},"und mehr",null,null,"von","bis",{"$nulls":6},"und mehr"]
[null,989.99,null,null,{"v":0,"d":"0.00"},{"v":0,"d":"0.00"},{"v":0,"d":"0.00"},{"v":0,"d":"0.00"},{"v":0,"d":"0.00"},{"v":0,"d":"0.00"},null,null,{"v":0,"d":"0.00"},{"v":1499.99,"d":"1,499.99"},null,{"v":0,"d":"0.00"},{"v":0,"d":"0.00"},{"v":0,"d":"0.00"},{"v":0,"d":"0.00"},{"v":0,"d":"0.00"},{"v":0,"d":"0.00"}]
[null,0.01,9.99,null,{"v":3.4,"d":"3.40"},{"v":0,"d":"0.00"},{"v":0,"d":"0.00"},{"v":0,"d":"0.00"},{"v":0,"d":"0.00"},{"v":0,"d":"0.00"},null,null,{"v":1500,"d":"1,500.00"},{"v":1509.99,"d":"1,509.99"},null,{"v":5.7749999999999995,"d":"5.78"},{"v":0,"d":"0.00"},{"v":0,"d":"0.00"},{"v":0,"d":"0.00"},{"v":0,"d":"0.00"},{"v":0,"d":"0.00"}]
[null,0.01,9.99,null,{"v":7,"d":"7.00"},{"v":0,"d":"0.00"},{"v":0,"d":"0.00"},{"v":0,"d":"0.00"},{"v":0,"d":"0.00"},{"v":0,"d":"0.00"},null,null,{"v":1510,"d":"1,510.00"},{"v":1519.99,"d":"1,519.99"},null,{"v":12.774999999999999,"d":"12.78"},{"v":0,"d":"0.00"},{"v":0,"d":"0.00"},{"v":0,"d":"0.00"},{"v":0,"d":"0.00"},{"v":0,"d":"0.00"}]
[null,0.01,9.99,null,{"v":7,"d":"7.00"},{"v":0,"d":"0.00"},{"v":0,"d":"0.00"},{"v":0,"d":"0.00"},{"v":0,"d":"0.00"},{"v":0,"d":"0.00"},null,null,{"v":1520,"d":"1,520.00"},{"v":1529.99,"d":"1,529.99"},null,{"v":19.775,"d":"19.78"},{"v":0,"d":"0.00"},{"v":0,"d":"0.00"},{"v":0,"d":"0.00"},{"v":0,"d":"0.00"},{"v":0,"d":"0.00"}]
[null,0.01,9.99,null,{"v":7,"d":"7.00"},{"v":0,"d":"0.00"},{"v":0,"d":"0.00"},{"v":0,"d":"0.00"},{"v":0,"d":"0.00"},{"v":0,"d":"0.00"},null,null,{"v":1530,"d":"1,530.00"},{"v":1539.99,"d":"1,539.99"},null,{"v":26.775,"d":"26.78"},{"v":0,"d":"0.00"},{"v":0,"d":"0.00"},{"v":0,"d":"0.00"},{"v":0,"d":"0.00"},{"v":0,"d":"0.00"}]
[null,0.01,9.99,null,{"v":7,"d":"7.00"},{"v":0,"d":"0.00"},{"v":0,"d":"0.00"},{"v":0,"d":"0.00"},{"v":0,"d":"0.00"},{"v":0,"d":"0.00"},null,null,{"v":1540,"d":"1,540.00"},{"v":1549.99,"d":"1,549.99"},null,{"v":33.775,"d":"33.78"},{"v":0,"d":"0.00"},{"v":0,"d":"0.00"},{"v":0,"d":"0.00"},{"v":0,"d":"0.00"},{"v":0,"d":"0.00"}]
[null,0.01,9.99,null,{"v":7,"d":"7.00"},{"v":0,"d":"0.00"},{"v":0,"d":"0.00"},{"v":0,"d":"0.00"},{"v":0,"d":"0.00"},{"v":0,"d":"0.00"},null,null,{"v":1550,"d":"1,550.00"},{"v":1559.99,"d":"1,559.99"},null,{"v":40.775,"d":"40.78"},{"v":0,"d":"0.00"},{"v":0,"d":"0.00"},{"v":0,"d":"0.00"},{"v":0,"d":"0.00"},{"v":0,"d":"0.00"}]
[null,0.01,9.99,null,{"v":7,"d":"7.00"},{"v":0,"d":"0.00"},{"v":0,"d":"0.00"},{"v":0,"d":"0.00"},{"v":0,"d":"0.00"},{"v":0,"d":"0.00"},null,null,{"v":1560,"d":"1,560.00"},{"v":1569.99,"d":"1,569.99"},null,{"v":47.775,"d":"47.78"},{"v":0,"d":"0.00"},{"v":0,"d":"0.00"},{"v":0,"d":"0.00"},{"v":0,"d":"0.00"},{"v":0,"d":"0.00"}]
[null,0.01,9.99,null,{"v":7,"d":"7.00"},{"v":0,"d":"0.00"},{"v":0,"d":"0.00"},{"v":0,"d":"0.00"},{"v":0,"d":"0.00"},{"v":0,"d":"0.00"},null,null,{"v":1570,"d":"1,570.00"},{"v":1579.99,"d":"1,579.99"},null,{"v":54.775,"d":"54.78"},{"v":0,"d":"0.00"},{"v":0,"d":"0.00"},{"v":0,"d":"0.00"},{"v":0,"d":"0.00"},{"v":0,"d":"0.00"}]
[null,0.01,9.99,null,{"v":7,"d":"7.00"},{"v":0,"d":"0.00"},{"v":0,"d":"0.00"},{"v":0,"d":"0.00"},{"v":0,"d":"0.00"},{"v":0,"d":"0.00"},null,null,{"v":1580,"d":"1,580.00"},{"v":1589.99,"d":"1,589.99"},null,{"v":61.775,"d":"61.78"},{"v":0,"d":"0.00"},{"v":0,"d":"0.00"},{"v":0,"d":"0.00"},{"v":0,"d":"0.00"},{"v":0,"d":"0.00"}]
{"$rows_left_out":302}
{"sheet":"Tabelle pfändbarer Beträge 2023","index":6,"n_rows":297,"n_cols":21,"rows_kept":297,"hidden":true,"merged":[[2,4,2,9],[2,12,2,13],[2,15,2,20],[3,1,3,2],[3,12,3,13]]}
[]
[]
[{"$nulls":4},"Pfändbarer Betrag bei Unterhaltspflicht für ... Personen",{"$nulls":7},"Nettolohn",null,null,"Pfändbarer Betrag bei Unterhaltspflicht für ... Personen\n(gültig vom 01.07.2023 bis 30.06.2024)"]
[null,"Nettolohn",null,null,0,1,2,3,4,5,null,null,"monatlich in Euro",null,null,0,1,2,3,4,5]
[null,"Add. Links","Add. Rechts",{"$nulls":6},"und mehr",null,null,"von","bis",{"$nulls":6},"und mehr"]
[null,989.99,null,null,{"v":0,"d":"0.00"},{"v":0,"d":"0.00"},{"v":0,"d":"0.00"},{"v":0,"d":"0.00"},{"v":0,"d":"0.00"},{"v":0,"d":"0.00"},{"$nulls":3},{"v":1409.99,"d":"1,409.99"},null,{"v":0,"d":"0.00"},{"v":0,"d":"0.00"},{"v":0,"d":"0.00"},{"v":0,"d":"0.00"},{"v":0,"d":"0.00"},{"v":0,"d":"0.00"}]
[null,0.01,9.99,null,{"v":3.4,"d":"3.40"},{"v":0,"d":"0.00"},{"v":0,"d":"0.00"},{"v":0,"d":"0.00"},{"v":0,"d":"0.00"},{"v":0,"d":"0.00"},null,null,{"v":1410,"d":"1,410.00"},{"v":1419.99,"d":"1,419.99"},null,{"v":5.404000000000019,"d":"5.40"},{"v":0,"d":"0.00"},{"v":0,"d":"0.00"},{"v":0,"d":"0.00"},{"v":0,"d":"0.00"},{"v":0,"d":"0.00"}]
[null,0.01,9.99,null,{"v":7,"d":"7.00"},{"v":0,"d":"0.00"},{"v":0,"d":"0.00"},{"v":0,"d":"0.00"},{"v":0,"d":"0.00"},{"v":0,"d":"0.00"},null,null,{"v":1420,"d":"1,420.00"},{"v":1429.99,"d":"1,429.99"},null,{"v":12.404000000000018,"d":"12.40"},{"v":0,"d":"0.00"},{"v":0,"d":"0.00"},{"v":0,"d":"0.00"},{"v":0,"d":"0.00"},{"v":0,"d":"0.00"}]
[null,0.01,9.99,null,{"v":7,"d":"7.00"},{"v":0,"d":"0.00"},{"v":0,"d":"0.00"},{"v":0,"d":"0.00"},{"v":0,"d":"0.00"},{"v":0,"d":"0.00"},null,null,{"v":1430,"d":"1,430.00"},{"v":1439.99,"d":"1,439.99"},null,{"v":19.404000000000018,"d":"19.40"},{"v":0,"d":"0.00"},{"v":0,"d":"0.00"},{"v":0,"d":"0.00"},{"v":0,"d":"0.00"},{"v":0,"d":"0.00"}]
[null,0.01,9.99,null,{"v":7,"d":"7.00"},{"v":0,"d":"0.00"},{"v":0,"d":"0.00"},{"v":0,"d":"0.00"},{"v":0,"d":"0.00"},{"v":0,"d":"0.00"},null,null,{"v":1440,"d":"1,440.00"},{"v":1449.99,"d":"1,449.99"},null,{"v":26.404000000000018,"d":"26.40"},{"v":0,"d":"0.00"},{"v":0,"d":"0.00"},{"v":0,"d":"0.00"},{"v":0,"d":"0.00"},{"v":0,"d":"0.00"}]
[null,0.01,9.99,null,{"v":7,"d":"7.00"},{"v":0,"d":"0.00"},{"v":0,"d":"0.00"},{"v":0,"d":"0.00"},{"v":0,"d":"0.00"},{"v":0,"d":"0.00"},null,null,{"v":1450,"d":"1,450.00"},{"v":1459.99,"d":"1,459.99"},null,{"v":33.40400000000002,"d":"33.40"},{"v":0,"d":"0.00"},{"v":0,"d":"0.00"},{"v":0,"d":"0.00"},{"v":0,"d":"0.00"},{"v":0,"d":"0.00"}]
[null,0.01,9.99,null,{"v":7,"d":"7.00"},{"v":0,"d":"0.00"},{"v":0,"d":"0.00"},{"v":0,"d":"0.00"},{"v":0,"d":"0.00"},{"v":0,"d":"0.00"},null,null,{"v":1460,"d":"1,460.00"},{"v":1469.99,"d":"1,469.99"},null,{"v":40.40400000000002,"d":"40.40"},{"v":0,"d":"0.00"},{"v":0,"d":"0.00"},{"v":0,"d":"0.00"},{"v":0,"d":"0.00"},{"v":0,"d":"0.00"}]
[null,0.01,9.99,null,{"v":7,"d":"7.00"},{"v":0,"d":"0.00"},{"v":0,"d":"0.00"},{"v":0,"d":"0.00"},{"v":0,"d":"0.00"},{"v":0,"d":"0.00"},null,null,{"v":1470,"d":"1,470.00"},{"v":1479.99,"d":"1,479.99"},null,{"v":47.40400000000002,"d":"47.40"},{"v":0,"d":"0.00"},{"v":0,"d":"0.00"},{"v":0,"d":"0.00"},{"v":0,"d":"0.00"},{"v":0,"d":"0.00"}]
[null,0.01,9.99,null,{"v":7,"d":"7.00"},{"v":0,"d":"0.00"},{"v":0,"d":"0.00"},{"v":0,"d":"0.00"},{"v":0,"d":"0.00"},{"v":0,"d":"0.00"},null,null,{"v":1480,"d":"1,480.00"},{"v":1489.99,"d":"1,489.99"},null,{"v":54.40400000000002,"d":"54.40"},{"v":0,"d":"0.00"},{"v":0,"d":"0.00"},{"v":0,"d":"0.00"},{"v":0,"d":"0.00"},{"v":0,"d":"0.00"}]
[null,0.01,9.99,null,{"v":7,"d":"7.00"},{"v":0,"d":"0.00"},{"v":0,"d":"0.00"},{"v":0,"d":"0.00"},{"v":0,"d":"0.00"},{"v":0,"d":"0.00"},null,null,{"v":1490,"d":"1,490.00"},{"v":1499.99,"d":"1,499.99"},null,{"v":61.40400000000002,"d":"61.40"},{"v":0,"d":"0.00"},{"v":0,"d":"0.00"},{"v":0,"d":"0.00"},{"v":0,"d":"0.00"},{"v":0,"d":"0.00"}]
{"$rows_left_out":283}
{"sheet":"Tabelle pfändbarer Beträge 2022","index":7,"n_rows":280,"n_cols":21,"rows_kept":280,"hidden":true,"merged":[[2,4,2,9],[2,12,2,13],[2,15,2,20],[3,1,3,2],[3,12,3,13]]}
[]
[]
[{"$nulls":4},"Pfändbarer Betrag bei Unterhaltspflicht für ... Personen",{"$nulls":7},"Nettolohn",null,null,"Pfändbarer Betrag bei Unterhaltspflicht für ... Personen\n(gültig vom 01.07.2022 bis 30.06.2023)"]
[null,"Nettolohn",null,null,0,1,2,3,4,5,null,null,"monatlich in Euro",null,null,0,1,2,3,4,5]
[null,"Add. Links","Add. Rechts",{"$nulls":6},"und mehr",null,null,"von","bis",{"$nulls":6},"und mehr"]
[null,989.99,null,null,{"v":0,"d":"0.00"},{"v":0,"d":"0.00"},{"v":0,"d":"0.00"},{"v":0,"d":"0.00"},{"v":0,"d":"0.00"},{"v":0,"d":"0.00"},{"$nulls":3},{"v":1339.99,"d":"1,339.99"},null,{"v":0,"d":"0.00"},{"v":0,"d":"0.00"},{"v":0,"d":"0.00"},{"v":0,"d":"0.00"},{"v":0,"d":"0.00"},{"v":0,"d":"0.00"}]
[null,0.01,9.99,null,{"v":3.4,"d":"3.40"},{"v":0,"d":"0.00"},{"v":0,"d":"0.00"},{"v":0,"d":"0.00"},{"v":0,"d":"0.00"},{"v":0,"d":"0.00"},null,null,{"v":1340,"d":"1,340.00"},{"$f":"10+N6","v":{"v":1349.99,"d":"1,349.99"}},null,6.89,{"v":0,"d":"0.00"},{"v":0,"d":"0.00"},{"v":0,"d":"0.00"},{"v":0,"d":"0.00"},{"v":0,"d":"0.00"}]
[null,0.01,9.99,null,{"v":7,"d":"7.00"},{"v":0,"d":"0.00"},{"v":0,"d":"0.00"},{"v":0,"d":"0.00"},{"v":0,"d":"0.00"},{"v":0,"d":"0.00"},null,null,{"$f":"10+M7","v":{"v":1350,"d":"1,350.00"}},{"$f":"10+N7","v":{"v":1359.99,"d":"1,359.99"}},null,13.89,{"v":0,"d":"0.00"},{"v":0,"d":"0.00"},{"v":0,"d":"0.00"},{"v":0,"d":"0.00"},{"v":0,"d":"0.00"}]
[null,0.01,9.99,null,{"v":7,"d":"7.00"},{"v":0,"d":"0.00"},{"v":0,"d":"0.00"},{"v":0,"d":"0.00"},{"v":0,"d":"0.00"},{"v":0,"d":"0.00"},null,null,{"$f":"10+M8","v":{"v":1360,"d":"1,360.00"}},{"v":1369.99,"d":"1,369.99"},null,20.89,{"v":0,"d":"0.00"},{"v":0,"d":"0.00"},{"v":0,"d":"0.00"},{"v":0,"d":"0.00"},{"v":0,"d":"0.00"}]
[null,0.01,9.99,null,{"v":7,"d":"7.00"},{"v":0,"d":"0.00"},{"v":0,"d":"0.00"},{"v":0,"d":"0.00"},{"v":0,"d":"0.00"},{"v":0,"d":"0.00"},null,null,{"v":1370,"d":"1,370.00"},{"v":1379.99,"d":"1,379.99"},null,27.89,{"v":0,"d":"0.00"},{"v":0,"d":"0.00"},{"v":0,"d":"0.00"},{"v":0,"d":"0.00"},{"v":0,"d":"0.00"}]
[null,0.01,9.99,null,{"v":7,"d":"7.00"},{"v":0,"d":"0.00"},{"v":0,"d":"0.00"},{"v":0,"d":"0.00"},{"v":0,"d":"0.00"},{"v":0,"d":"0.00"},null,null,{"v":1380,"d":"1,380.00"},{"v":1389.99,"d":"1,389.99"},null,34.89,{"v":0,"d":"0.00"},{"v":0,"d":"0.00"},{"v":0,"d":"0.00"},{"v":0,"d":"0.00"},{"v":0,"d":"0.00"}]
[null,0.01,9.99,null,{"v":7,"d":"7.00"},{"v":0,"d":"0.00"},{"v":0,"d":"0.00"},{"v":0,"d":"0.00"},{"v":0,"d":"0.00"},{"v":0,"d":"0.00"},null,null,{"v":1390,"d":"1,390.00"},{"v":1399.99,"d":"1,399.99"},null,41.89,{"v":0,"d":"0.00"},{"v":0,"d":"0.00"},{"v":0,"d":"0.00"},{"v":0,"d":"0.00"},{"v":0,"d":"0.00"}]
[null,0.01,9.99,null,{"v":7,"d":"7.00"},{"v":0,"d":"0.00"},{"v":0,"d":"0.00"},{"v":0,"d":"0.00"},{"v":0,"d":"0.00"},{"v":0,"d":"0.00"},null,null,{"v":1400,"d":"1,400.00"},{"v":1409.99,"d":"1,409.99"},null,48.89,{"v":0,"d":"0.00"},{"v":0,"d":"0.00"},{"v":0,"d":"0.00"},{"v":0,"d":"0.00"},{"v":0,"d":"0.00"}]
[null,0.01,9.99,null,{"v":7,"d":"7.00"},{"v":0,"d":"0.00"},{"v":0,"d":"0.00"},{"v":0,"d":"0.00"},{"v":0,"d":"0.00"},{"v":0,"d":"0.00"},null,null,{"v":1410,"d":"1,410.00"},{"v":1419.99,"d":"1,419.99"},null,55.89,{"v":0,"d":"0.00"},{"v":0,"d":"0.00"},{"v":0,"d":"0.00"},{"v":0,"d":"0.00"},{"v":0,"d":"0.00"}]
[null,0.01,9.99,null,{"v":7,"d":"7.00"},{"v":0,"d":"0.00"},{"v":0,"d":"0.00"},{"v":0,"d":"0.00"},{"v":0,"d":"0.00"},{"v":0,"d":"0.00"},null,null,{"v":1420,"d":"1,420.00"},{"v":1429.99,"d":"1,429.99"},null,62.89,{"v":0,"d":"0.00"},{"v":0,"d":"0.00"},{"v":0,"d":"0.00"},{"v":0,"d":"0.00"},{"v":0,"d":"0.00"}]
{"$rows_left_out":266}
{"sheet":"Tabelle pfändbarer Beträge 2021","index":8,"n_rows":265,"n_cols":21,"rows_kept":265,"hidden":true,"merged":[[2,4,2,9],[2,12,2,13],[2,15,2,20],[3,1,3,2],[3,12,3,13]]}
[]
[]
[{"$nulls":4},"Pfändbarer Betrag bei Unterhaltspflicht für ... Personen",{"$nulls":7},"Nettolohn",null,null,"Pfändbarer Betrag bei Unterhaltspflicht für ... Personen\n(gültig vom 01.07.2013 bis 30.06.2015)"]
[null,"Nettolohn",null,null,0,1,2,3,4,5,null,null,"monatlich in Euro",null,null,0,1,2,3,4,5]
[null,"Add. Links","Add. Rechts",{"$nulls":6},"und mehr",null,null,"von","bis",{"$nulls":6},"und mehr"]
[null,989.99,null,null,{"v":0,"d":"0.00"},{"v":0,"d":"0.00"},{"v":0,"d":"0.00"},{"v":0,"d":"0.00"},{"v":0,"d":"0.00"},{"v":0,"d":"0.00"},{"$nulls":3},{"v":1259.99,"d":"1,259.99"},null,{"v":0,"d":"0.00"},{"v":0,"d":"0.00"},{"v":0,"d":"0.00"},{"v":0,"d":"0.00"},{"v":0,"d":"0.00"},{"v":0,"d":"0.00"}]
[null,0.01,9.99,null,{"v":3.4,"d":"3.40"},{"v":0,"d":"0.00"},{"v":0,"d":"0.00"},{"v":0,"d":"0.00"},{"v":0,"d":"0.00"},{"v":0,"d":"0.00"},null,null,{"v":1260,"d":"1,260.00"},{"$f":"10+N6","v":{"v":1269.99,"d":"1,269.99"}},null,5.15,{"v":0,"d":"0.00"},{"v":0,"d":"0.00"},{"v":0,"d":"0.00"},{"v":0,"d":"0.00"},{"v":0,"d":"0.00"}]
[null,0.01,9.99,null,{"v":7,"d":"7.00"},{"v":0,"d":"0.00"},{"v":0,"d":"0.00"},{"v":0,"d":"0.00"},{"v":0,"d":"0.00"},{"v":0,"d":"0.00"},null,null,{"$f":"10+M7","v":{"v":1270,"d":"1,270.00"}},{"$f":"10+N7","v":{"v":1279.99,"d":"1,279.99"}},null,12.15,{"v":0,"d":"0.00"},{"v":0,"d":"0.00"},{"v":0,"d":"0.00"},{"v":0,"d":"0.00"},{"v":0,"d":"0.00"}]
[null,0.01,9.99,null,{"v":7,"d":"7.00"},{"v":0,"d":"0.00"},{"v":0,"d":"0.00"},{"v":0,"d":"0.00"},{"v":0,"d":"0.00"},{"v":0,"d":"0.00"},null,null,{"$f":"10+M8","v":{"v":1280,"d":"1,280.00"}},{"v":1289.99,"d":"1,289.99"},null,19.15,{"v":0,"d":"0.00"},{"v":0,"d":"0.00"},{"v":0,"d":"0.00"},{"v":0,"d":"0.00"},{"v":0,"d":"0.00"}]
[null,0.01,9.99,null,{"v":7,"d":"7.00"},{"v":0,"d":"0.00"},{"v":0,"d":"0.00"},{"v":0,"d":"0.00"},{"v":0,"d":"0.00"},{"v":0,"d":"0.00"},null,null,{"v":1290,"d":"1,290.00"},{"v":1299.99,"d":"1,299.99"},null,26.15,{"v":0,"d":"0.00"},{"v":0,"d":"0.00"},{"v":0,"d":"0.00"},{"v":0,"d":"0.00"},{"v":0,"d":"0.00"}]
[null,0.01,9.99,null,{"v":7,"d":"7.00"},{"v":0,"d":"0.00"},{"v":0,"d":"0.00"},{"v":0,"d":"0.00"},{"v":0,"d":"0.00"},{"v":0,"d":"0.00"},null,null,{"v":1300,"d":"1,300.00"},{"v":1309.99,"d":"1,309.99"},null,33.15,{"v":0,"d":"0.00"},{"v":0,"d":"0.00"},{"v":0,"d":"0.00"},{"v":0,"d":"0.00"},{"v":0,"d":"0.00"}]
[null,0.01,9.99,null,{"v":7,"d":"7.00"},{"v":0,"d":"0.00"},{"v":0,"d":"0.00"},{"v":0,"d":"0.00"},{"v":0,"d":"0.00"},{"v":0,"d":"0.00"},null,null,{"v":1310,"d":"1,310.00"},{"v":1319.99,"d":"1,319.99"},null,40.15,{"v":0,"d":"0.00"},{"v":0,"d":"0.00"},{"v":0,"d":"0.00"},{"v":0,"d":"0.00"},{"v":0,"d":"0.00"}]
[null,0.01,9.99,null,{"v":7,"d":"7.00"},{"v":0,"d":"0.00"},{"v":0,"d":"0.00"},{"v":0,"d":"0.00"},{"v":0,"d":"0.00"},{"v":0,"d":"0.00"},null,null,{"v":1320,"d":"1,320.00"},{"v":1329.99,"d":"1,329.99"},null,47.15,{"v":0,"d":"0.00"},{"v":0,"d":"0.00"},{"v":0,"d":"0.00"},{"v":0,"d":"0.00"},{"v":0,"d":"0.00"}]
[null,0.01,9.99,null,{"v":7,"d":"7.00"},{"v":0,"d":"0.00"},{"v":0,"d":"0.00"},{"v":0,"d":"0.00"},{"v":0,"d":"0.00"},{"v":0,"d":"0.00"},null,null,{"v":1330,"d":"1,330.00"},{"v":1339.99,"d":"1,339.99"},null,54.15,{"v":0,"d":"0.00"},{"v":0,"d":"0.00"},{"v":0,"d":"0.00"},{"v":0,"d":"0.00"},{"v":0,"d":"0.00"}]
[null,0.01,9.99,null,{"v":7,"d":"7.00"},{"v":0,"d":"0.00"},{"v":0,"d":"0.00"},{"v":0,"d":"0.00"},{"v":0,"d":"0.00"},{"v":0,"d":"0.00"},null,null,{"v":1340,"d":"1,340.00"},{"v":1349.99,"d":"1,349.99"},null,61.15,{"v":0,"d":"0.00"},{"v":0,"d":"0.00"},{"v":0,"d":"0.00"},{"v":0,"d":"0.00"},{"v":0,"d":"0.00"}]
{"$rows_left_out":251}
{"sheet":"Tabelle pfändbarer Beträge 2020","index":9,"n_rows":250,"n_cols":21,"rows_kept":250,"hidden":true,"merged":[[2,4,2,9],[2,12,2,13],[2,15,2,20],[3,1,3,2],[3,12,3,13]]}
[]
[]
[{"$nulls":4},"Pfändbarer Betrag bei Unterhaltspflicht für ... Personen",{"$nulls":7},"Nettolohn",null,null,"Pfändbarer Betrag bei Unterhaltspflicht für ... Personen\n(gültig vom 01.07.2013 bis 30.06.2015)"]
[null,"Nettolohn",null,null,0,1,2,3,4,5,null,null,"monatlich in Euro",null,null,0,1,2,3,4,5]
[null,"Add. Links","Add. Rechts",{"$nulls":6},"und mehr",null,null,"von","bis",{"$nulls":6},"und mehr"]
[null,989.99,null,null,{"v":0,"d":"0.00"},{"v":0,"d":"0.00"},{"v":0,"d":"0.00"},{"v":0,"d":"0.00"},{"v":0,"d":"0.00"},{"v":0,"d":"0.00"},{"$nulls":3},{"v":1179.99,"d":"1,179.99"},null,{"v":0,"d":"0.00"},{"v":0,"d":"0.00"},{"v":0,"d":"0.00"},{"v":0,"d":"0.00"},{"v":0,"d":"0.00"},{"v":0,"d":"0.00"}]
[null,0.01,9.99,null,{"v":3.4,"d":"3.40"},{"v":0,"d":"0.00"},{"v":0,"d":"0.00"},{"v":0,"d":"0.00"},{"v":0,"d":"0.00"},{"v":0,"d":"0.00"},null,null,{"v":1180,"d":"1,180.00"},{"$f":"10+N6","v":{"v":1189.99,"d":"1,189.99"}},null,0.99,{"v":0,"d":"0.00"},{"v":0,"d":"0.00"},{"v":0,"d":"0.00"},{"v":0,"d":"0.00"},{"v":0,"d":"0.00"}]
[null,0.01,9.99,null,{"v":7,"d":"7.00"},{"v":0,"d":"0.00"},{"v":0,"d":"0.00"},{"v":0,"d":"0.00"},{"v":0,"d":"0.00"},{"v":0,"d":"0.00"},null,null,{"$f":"10+M7","v":{"v":1190,"d":"1,190.00"}},{"$f":"10+N7","v":{"v":1199.99,"d":"1,199.99"}},null,{"$f":"7+P7","v":7.99},{"v":0,"d":"0.00"},{"v":0,"d":"0.00"},{"v":0,"d":"0.00"},{"v":0,"d":"0.00"},{"v":0,"d":"0.00"}]
[null,0.01,9.99,null,{"v":7,"d":"7.00"},{"v":0,"d":"0.00"},{"v":0,"d":"0.00"},{"v":0,"d":"0.00"},{"v":0,"d":"0.00"},{"v":0,"d":"0.00"},null,null,{"$f":"10+M8","v":{"v":1200,"d":"1,200.00"}},{"v":1209.99,"d":"1,209.99"},null,{"$f":"7+P8","v":14.99},{"v":0,"d":"0.00"},{"v":0,"d":"0.00"},{"v":0,"d":"0.00"},{"v":0,"d":"0.00"},{"v":0,"d":"0.00"}]
[null,0.01,9.99,null,{"v":7,"d":"7.00"},{"v":0,"d":"0.00"},{"v":0,"d":"0.00"},{"v":0,"d":"0.00"},{"v":0,"d":"0.00"},{"v":0,"d":"0.00"},null,null,{"v":1210,"d":"1,210.00"},{"v":1219.99,"d":"1,219.99"},null,{"v":21.990000000000002,"d":"21.99"},{"v":0,"d":"0.00"},{"v":0,"d":"0.00"},{"v":0,"d":"0.00"},{"v":0,"d":"0.00"},{"v":0,"d":"0.00"}]
[null,0.01,9.99,null,{"v":7,"d":"7.00"},{"v":0,"d":"0.00"},{"v":0,"d":"0.00"},{"v":0,"d":"0.00"},{"v":0,"d":"0.00"},{"v":0,"d":"0.00"},null,null,{"v":1220,"d":"1,220.00"},{"v":1229.99,"d":"1,229.99"},null,{"v":28.990000000000002,"d":"28.99"},{"v":0,"d":"0.00"},{"v":0,"d":"0.00"},{"v":0,"d":"0.00"},{"v":0,"d":"0.00"},{"v":0,"d":"0.00"}]
[null,0.01,9.99,null,{"v":7,"d":"7.00"},{"v":0,"d":"0.00"},{"v":0,"d":"0.00"},{"v":0,"d":"0.00"},{"v":0,"d":"0.00"},{"v":0,"d":"0.00"},null,null,{"v":1230,"d":"1,230.00"},{"v":1239.99,"d":"1,239.99"},null,35.99,{"v":0,"d":"0.00"},{"v":0,"d":"0.00"},{"v":0,"d":"0.00"},{"v":0,"d":"0.00"},{"v":0,"d":"0.00"}]
[null,0.01,9.99,null,{"v":7,"d":"7.00"},{"v":0,"d":"0.00"},{"v":0,"d":"0.00"},{"v":0,"d":"0.00"},{"v":0,"d":"0.00"},{"v":0,"d":"0.00"},null,null,{"v":1240,"d":"1,240.00"},{"v":1249.99,"d":"1,249.99"},null,42.99,{"v":0,"d":"0.00"},{"v":0,"d":"0.00"},{"v":0,"d":"0.00"},{"v":0,"d":"0.00"},{"v":0,"d":"0.00"}]
[null,0.01,9.99,null,{"v":7,"d":"7.00"},{"v":0,"d":"0.00"},{"v":0,"d":"0.00"},{"v":0,"d":"0.00"},{"v":0,"d":"0.00"},{"v":0,"d":"0.00"},null,null,{"v":1250,"d":"1,250.00"},{"v":1259.99,"d":"1,259.99"},null,49.99,{"v":0,"d":"0.00"},{"v":0,"d":"0.00"},{"v":0,"d":"0.00"},{"v":0,"d":"0.00"},{"v":0,"d":"0.00"}]
[null,0.01,9.99,null,{"v":7,"d":"7.00"},{"v":0,"d":"0.00"},{"v":0,"d":"0.00"},{"v":0,"d":"0.00"},{"v":0,"d":"0.00"},{"v":0,"d":"0.00"},null,null,{"v":1260,"d":"1,260.00"},{"v":1269.99,"d":"1,269.99"},null,56.99,{"v":0,"d":"0.00"},{"v":0,"d":"0.00"},{"v":0,"d":"0.00"},{"v":0,"d":"0.00"},{"v":0,"d":"0.00"}]
{"$rows_left_out":236}
{"sheet":"Parameter_Intern","index":10,"n_rows":35,"n_cols":5,"rows_kept":35,"hidden":true}
[]
[]
[]
[null,"Nr","Tabellenblatt","Hinweise","Hyperlink"]
[null,1,"Eingaben","Hier geben Sie die Daten für den Lohnpfändungsrechner ein","#Eingaben!B3"]
[null,2,"Beispiel","Hier finden Sie ein Beispiel für die Eingaben","#Beispiel!B3"]
[null,3,"Berechnung","Dieses kommen Sie direkt zum Lohnpfändungsrechner","#Berechnung!B3"]
[null,4,"Hilfe","Hier finden Sie nähere Informationen über die Anwendung.","#Hilfe!B3"]
{"$rows_empty":24}
[null,"© BWRmed!a, ein Unternehmensbereich der VNR Verlag für die Deutsche Wirtschaft AG - HRexperten24.de"]
[null,"Die Vervielfältigung, Verbreitung oder Veräußerung der Daten oder Texte ist unzulässig und"]
[null,"ausdrücklich nur mit Genehmigung des Verlags gestattet."]