{"text_format":"3","workbook":"xlsx","n_sheets":9,"sheets":["Startseite","Eingaben","Berechnung","Beispiel","Hilfe","Stammdaten","Pauschalen","Parameter_Intern","__Goal_Metadata"],"not_rendered":{"images":5,"macros":1,"defined_names":22,"comments":1},"read":"whole","date_system":"1900"}

{"sheet":"Startseite","index":0,"n_rows":41,"n_cols":14,"rows_kept":41,"merged":[[10,6,14,7],[11,12,11,13],[16,3,16,4]]}
[]
[]
[]
[{"$nulls":9},"Startseite"]
[null,"Reisekostenrechner 2026"]
[]
[]
[]
[{"$nulls":3},"Tabellenblätter",{"$nulls":8},"Tabellenblatt",2]
[{"$nulls":6},"Info"]
[{"$nulls":6},{"$f":"INDEX(Parameter_Intern!C5:D10,Startseite!N9,2)","v":"In diesem Arbeitsblatt wird die Reisekostenabrechnung erstellt"},{"$nulls":5},{"$f":"+N9/2","v":1},{"$f":"+ROUND(N9/2,0)","v":1}]
[{"$nulls":12},{"$f":"IF(M11=N11,1,2)","v":1}]
[]
[]
[]
[]
[{"$nulls":3},{"$f":"\"Bei einem Klick auf \"&H17&\" kommen Sie direkt zum entsprechenden Arbeitsblatt\"","v":"Bei einem Klick auf Berechnung kommen Sie direkt zum entsprechenden Arbeitsblatt"},{"$nulls":3},{"$f":"+HYPERLINK(VLOOKUP($N$9,Parameter_Intern!$B$5:$E$30,4,FALSE),VLOOKUP($N$9,Parameter_Intern!$B$5:$E$30,2,FALSE))","v":"Berechnung"}]
{"$rows_empty":21}
[null,"© 2026 by mediaforwork - ein Unternehmensbereich der Verlag für die Deutsche Wirtschaft AG"]
[null,"Die Vervielfältigung, Verbreitung oder Veräußerung der Daten oder Texte ist unzulässig und"]
[null,"ausdrücklich nur mit Genehmigung des Verlags gestattet."]

{"sheet":"Eingaben","index":1,"n_rows":77,"n_cols":27,"rows_kept":77,"merged":[[1,1,1,13],[3,5,3,7],[11,4,13,12],[39,4,39,7],[40,4,40,7],[41,4,41,7],[42,4,42,7],[43,4,43,7],[44,4,44,7],[45,4,45,7],[46,4,46,7],[47,4,47,7],[52,1,52,3],[52,6,52,8]]}
[{"$nulls":13},"Eingaben"]
[null,"Reisekostenrechner 2026 - Eingaben",{"$nulls":17},1.6]
[{"$nulls":18},1,4.8]
[{"$nulls":3},"Mitarbeiter auswählen:",null,"Mustermann, Max",{"$nulls":3},{"$f":"+IF(U5=\"Fehler\",\"<- Mitarbeiter wählen\",\"\")","v":""}]
[{"$nulls":18},"Mitarbeiter",null,{"$f":"IF(ISERROR(VLOOKUP($F$4,Stammdaten!$C$13:$O$34,1,FALSE)&\", \"&VLOOKUP($F$4,Stammdaten!$C$13:$O$34,7,FALSE)&\", \"&VLOOKUP($F$4,Stammdaten!$C$13:$O$34,8,FALSE)&\" \"&VLOOKUP($F$4,Stammdaten!$C$13:$O$34,9,FALSE)),\"Fehler\",VLOOKUP($F$4,Stammdaten!$C$13:$O$34,1,FALSE)&\", \"&VLOOKUP($F$4,Stammdaten!$C$13:$O$34,7,FALSE)&\", \"&VLOOKUP($F$4,Stammdaten!$C$13:$O$34,8,FALSE)&\" \"&VLOOKUP($F$4,Stammdaten!$C$13:$O$34,9,FALSE))","v":"Mustermann, Max, Musterstraße 11, 47111 Musterstadt"}]
[{"$nulls":3},"Beginn der Reise",{"$nulls":6},"USt-Satz ",{"$nulls":7},{"$f":"+IF(Stammdaten!G13=\"\",\"\",Stammdaten!G13)","v":"Mustermann, Max"}]
[{"$nulls":3},"Ende der Reise",{"$nulls":5},{"$f":"IF(F7<F6,\"Datum prüfen\",IF(AND(F7=F6,H7<H6),\"Zeiten prüfen\",\"\"))","v":""},{"$nulls":8},{"$f":"+IF(Stammdaten!G14=\"\",\"\",Stammdaten!G14)","v":"Müller, Hein-Otto"}]
[{"$nulls":3},{"$f":"+IF(AND(V12>=3,U35>90),\"Dreimonatsfrist beachten - Rechner nicht anwendbar\",\"\")","v":""},{"$nulls":14},{"$f":"+IF(Stammdaten!G15=\"\",\"\",Stammdaten!G15)","v":"Meier, Otti"}]
[{"$nulls":3},"Reiseland:",{"$nulls":14},{"$f":"+IF(Stammdaten!G16=\"\",\"\",Stammdaten!G16)","v":""},null,"Dreimonatsfrist"]
[{"$nulls":18},{"$f":"+IF(Stammdaten!G17=\"\",\"\",Stammdaten!G17)","v":""},null,"Jahr/Monat",{"$f":"+YEAR(F6)&MONTH(F6)","v":"19001"}]
[{"$nulls":18},{"$f":"+IF(Stammdaten!G18=\"\",\"\",Stammdaten!G18)","v":""},null,"Jahr/Monat",{"$f":"+YEAR(F7)&MONTH(F7)","v":"19001"}]
[{"$nulls":3},"Reisezweck:",{"$nulls":14},{"$f":"+IF(Stammdaten!G19=\"\",\"\",Stammdaten!G19)","v":""},null,null,{"$f":"+V11-V10","v":0}]
[{"$nulls":18},{"$f":"+IF(Stammdaten!G20=\"\",\"\",Stammdaten!G20)","v":""}]
[{"$nulls":18},{"$f":"+IF(Stammdaten!G21=\"\",\"\",Stammdaten!G21)","v":""}]
[{"$nulls":18},{"$f":"+IF(Stammdaten!G22=\"\",\"\",Stammdaten!G22)","v":""}]
[{"$nulls":3},"Angaben zu Fahrkosten",{"$nulls":14},{"$f":"+IF(Stammdaten!G23=\"\",\"\",Stammdaten!G23)","v":""}]
[{"$nulls":18},{"$f":"+IF(Stammdaten!G24=\"\",\"\",Stammdaten!G24)","v":""}]
[{"$nulls":3},"Bahnfahrten (brutto)",{"$nulls":7},{"$f":"IF(ISERROR(IF(ISNUMBER(J18),$L$6,0)),\"\",IF(ISNUMBER(J18),$L$6,0))","v":{"v":0,"d":"0.00%"}},{"$nulls":6},{"$f":"+IF(Stammdaten!G25=\"\",\"\",Stammdaten!G25)","v":""}]
[{"$nulls":3},"Flugkarten (brutto)",{"$nulls":7},{"$f":"IF(ISERROR(IF(ISNUMBER(J19),$L$6,0)),\"\",IF(ISNUMBER(J19),$L$6,0))","v":{"v":0,"d":"0.00%"}},{"$nulls":6},{"$f":"+IF(Stammdaten!G26=\"\",\"\",Stammdaten!G26)","v":""}]
[{"$nulls":3},"Autokosten (brutto)",{"$nulls":7},{"$f":"IF(ISERROR(IF(ISNUMBER(J20),$L$6,0)),\"\",IF(ISNUMBER(J20),$L$6,0))","v":{"v":0,"d":"0.00%"}},{"$nulls":6},{"$f":"+IF(Stammdaten!G27=\"\",\"\",Stammdaten!G27)","v":""}]
[{"$nulls":18},{"$f":"+IF(Stammdaten!G28=\"\",\"\",Stammdaten!G28)","v":""}]
[{"$nulls":3},"Fahrten mit Privat-PKW",{"$nulls":14},{"$f":"+IF(Stammdaten!G29=\"\",\"\",Stammdaten!G29)","v":""}]
[{"$nulls":18},{"$f":"+IF(Stammdaten!G30=\"\",\"\",Stammdaten!G30)","v":""}]
[{"$nulls":3},"Gefahrene km:",{"$nulls":14},{"$f":"+IF(Stammdaten!G31=\"\",\"\",Stammdaten!G31)","v":""}]
[{"$nulls":18},{"$f":"+IF(Stammdaten!G32=\"\",\"\",Stammdaten!G32)","v":""}]
[{"$nulls":3},"Übernachtungskosten",{"$nulls":14},{"$f":"+IF(Stammdaten!G33=\"\",\"\",Stammdaten!G33)","v":""}]
[]
[{"$nulls":3},"Anzahl Übernachtungen",{"$nulls":7},{"$f":"IF(U32=1,0,IF(ISERROR(IF(ISNUMBER(J29),$L$6,0)),\"\",IF(ISNUMBER(J29),$L$6,0)))","v":{"v":0,"d":"0.00%"}}]
[{"$nulls":3},{"$f":"+IF(U32=0,\"Kosten für Übernachtungen - gesamt brutto\",\"Pauschale Übernachtungskosten\")","v":"Pauschale Übernachtungskosten"},{"$nulls":5},{"v":370,"d":"370.00"},null,{"$f":"+IF(U32=0,\"\",J28*VLOOKUP($T$31,Pauschalen!$E$6:$M$221,9,FALSE))","v":{"v":0,"d":"0.00"}},{"$nulls":6},"Pauschale Deutschland",{"$f":"+IF(S3=1,T2,T3)","v":1.6},{"$f":"+IF(ISERROR(T29*J28),0,T29*J28)","v":0}]
[{"$nulls":9},{"$f":"IF(U33=0,0,IF(U31=\"Deutschland\",-U29,J28*VLOOKUP($T$31,Pauschalen!$E$5:$M$221,7,FALSE)))","v":{"v":0,"d":"0.00"}},null,{"$f":"IF(U33=0,0,J28*VLOOKUP($T$31,Pauschalen!$E$5:$M$221,7,FALSE))","v":{"v":0,"d":"0.00"}}]
{"$rows_left_out":48}
{"sheet":"Berechnung","index":2,"n_rows":82,"n_cols":34,"rows_kept":82,"merged":[[1,1,1,19],[3,5,3,7],[11,14,11,15],[12,5,12,7],[14,4,16,18],[54,4,54,7],[55,4,55,7],[56,4,56,7],[57,4,57,7],[58,4,58,7],[59,4,59,7],[60,4,60,7],[61,4,61,7],[62,4,62,7],[77,1,77,3],[77,7,77,9],[77,11,77,13]]}
[{"$nulls":19},"Berechnung"]
[null,"Reisekostenrechner - Berechnung"]
[]
[{"$nulls":3},"Mitarbeiter:",null,{"$f":"+Eingaben!F4","v":"Mustermann, Max"},{"$nulls":3},{"$f":"+IF(AA5=\"Fehler\",\"<- Mitarbeiter wählen\",\"\")","v":""}]
[{"$nulls":24},"Mitarbeiter",null,{"$f":"IF(ISERROR(VLOOKUP($F$4,Stammdaten!$C$13:$O$34,1,FALSE)&\", \"&VLOOKUP($F$4,Stammdaten!$C$13:$O$34,7,FALSE)&\", \"&VLOOKUP($F$4,Stammdaten!$C$13:$O$34,8,FALSE)&\" \"&VLOOKUP($F$4,Stammdaten!$C$13:$O$34,9,FALSE)),\"Fehler\",VLOOKUP($F$4,Stammdaten!$C$13:$O$34,1,FALSE)&\", \"&VLOOKUP($F$4,Stammdaten!$C$13:$O$34,7,FALSE)&\", \"&VLOOKUP($F$4,Stammdaten!$C$13:$O$34,8,FALSE)&\" \"&VLOOKUP($F$4,Stammdaten!$C$13:$O$34,9,FALSE))","v":"Mustermann, Max, Musterstraße 11, 47111 Musterstadt"}]
[{"$nulls":3},"Beginn der Reise",null,{"$f":"+Eingaben!F6","v":"00:00:00"},"um",{"$f":"+Eingaben!H6","v":"00:00:00"},null,null,"USt-Satz ",{"$f":"+Eingaben!L6","v":{"v":0,"d":"0.00%"}},{"$nulls":12},{"$f":"+IF(Stammdaten!G13=\"\",\"\",Stammdaten!G13)","v":"Mustermann, Max"}]
[{"$nulls":3},"Ende der Reise",null,{"$f":"+Eingaben!F7","v":"00:00:00"},"um",{"$f":"+Eingaben!H7","v":"00:00:00"},null,{"$f":"IF(F7<F6,\"Datum prüfen\",IF(AND(F7=F6,H7<H6),\"Zeiten prüfen\",\"\"))","v":""},{"$nulls":14},{"$f":"+IF(Stammdaten!G14=\"\",\"\",Stammdaten!G14)","v":"Müller, Hein-Otto"}]
[{"$nulls":24},{"$f":"+IF(Stammdaten!G15=\"\",\"\",Stammdaten!G15)","v":"Meier, Otti"}]
[null," Reisekostenabrechnung 2026",{"$nulls":22},{"$f":"+IF(Stammdaten!G16=\"\",\"\",Stammdaten!G16)","v":""}]
[{"$nulls":24},{"$f":"+IF(Stammdaten!G17=\"\",\"\",Stammdaten!G17)","v":""}]
[{"$nulls":3},{"$f":"IF(ISERROR(\"Name/Adresse des Mitarbeiters: \"&AA5),\"\",\"Name/Adresse des Mitarbeiters: \"&AA5)","v":"Name/Adresse des Mitarbeiters: Mustermann, Max, Musterstraße 11, 47111 Musterstadt"},{"$nulls":20},{"$f":"+IF(Stammdaten!G18=\"\",\"\",Stammdaten!G18)","v":""}]
[{"$nulls":3},"Beginn der Reise:",null,{"$f":"+F6","v":"00:00:00"},"um",{"$f":"+H6","v":"00:00:00"},"Uhr",null,"Ende",{"$f":"+F7","v":"00:00:00"},null,"um",{"$f":"+H7","v":"00:00:00"},null,"Uhr",{"$nulls":7},{"$f":"+IF(Stammdaten!G19=\"\",\"\",Stammdaten!G19)","v":""}]
[{"$nulls":3},"Reiseland:",null,{"$f":"+AA31","v":"Deutschland"},{"$nulls":3},{"$f":"+IF(AA32=1,\"mit Pauschalen abrechnen\",\"\")","v":"mit Pauschalen abrechnen"},{"$nulls":14},{"$f":"+IF(Stammdaten!G20=\"\",\"\",Stammdaten!G20)","v":""}]
[{"$nulls":24},{"$f":"+IF(Stammdaten!G21=\"\",\"\",Stammdaten!G21)","v":""}]
[{"$nulls":3},"Reisezweck:",{"$f":"IF(Eingaben!E12=\"\",\"\",Eingaben!E12)","v":""},{"$nulls":19},{"$f":"+IF(Stammdaten!G22=\"\",\"\",Stammdaten!G22)","v":""}]
[{"$nulls":24},{"$f":"+IF(Stammdaten!G23=\"\",\"\",Stammdaten!G23)","v":""}]
[{"$nulls":24},{"$f":"+IF(Stammdaten!G24=\"\",\"\",Stammdaten!G24)","v":""}]
[{"$nulls":24},{"$f":"+IF(Stammdaten!G25=\"\",\"\",Stammdaten!G25)","v":""}]
[{"$nulls":3},"Fahrkosten",{"$nulls":9},"Brutto",null,"VSt",null,"Netto",{"$nulls":6},{"$f":"+IF(Stammdaten!G26=\"\",\"\",Stammdaten!G26)","v":""}]
[{"$nulls":24},{"$f":"+IF(Stammdaten!G27=\"\",\"\",Stammdaten!G27)","v":""}]
[{"$nulls":3},"Bahnfahrten (brutto)",{"$nulls":5},{"$f":"+IF(Eingaben!J18=\"\",\"\",Eingaben!J18)","v":""},null,{"$f":"+IF(Eingaben!L18=\"\",\"\",Eingaben!L18)","v":{"v":0,"d":"0.00%"}},null,{"$f":"+J21","v":""},null,{"$f":"IF(Eingaben!F6=\"\",\"\",IF(ISERROR(IF(OR(N21=\"\",N21=0),0,-ROUND(N21/(1+L21)*L21,2))),0,IF(OR(N21=\"\",N21=0),0,-ROUND(N21/(1+L21)*L21,2))))","v":""},null,{"$f":"IF(Eingaben!F6=\"\",\"\",IF(ISERROR(IF(OR(N21=0,N21=\"\"),0,N21+P21)),0,IF(OR(N21=0,N21=\"\"),0,N21+P21)))","v":""},{"$nulls":6},{"$f":"+IF(Stammdaten!G28=\"\",\"\",Stammdaten!G28)","v":""}]
[{"$nulls":3},"Flugkarten (brutto)",{"$nulls":5},{"$f":"+IF(Eingaben!J19=\"\",\"\",Eingaben!J19)","v":""},null,{"$f":"+IF(Eingaben!L19=\"\",\"\",Eingaben!L19)","v":{"v":0,"d":"0.00%"}},null,{"$f":"+J22","v":""},null,{"$f":"IF(Eingaben!F6=\"\",\"\",IF(ISERROR(IF(OR(N22=\"\",N22=0),0,-ROUND(N22/(1+L22)*L22,2))),0,IF(OR(N22=\"\",N22=0),0,-ROUND(N22/(1+L22)*L22,2))))","v":""},null,{"$f":"IF(Eingaben!F6=\"\",\"\",IF(ISERROR(IF(OR(N22=0,N22=\"\"),0,N22+P22)),0,IF(OR(N22=0,N22=\"\"),0,N22+P22)))","v":""},{"$nulls":6},{"$f":"+IF(Stammdaten!G29=\"\",\"\",Stammdaten!G29)","v":""}]
[{"$nulls":3},"Autokosten (brutto)",{"$nulls":5},{"$f":"+IF(Eingaben!J20=\"\",\"\",Eingaben!J20)","v":""},null,{"$f":"+IF(Eingaben!L20=\"\",\"\",Eingaben!L20)","v":{"v":0,"d":"0.00%"}},null,{"$f":"+J23","v":""},null,{"$f":"IF(Eingaben!F6=\"\",\"\",IF(ISERROR(IF(OR(N23=\"\",N23=0),0,-ROUND(N23/(1+L23)*L23,2))),0,IF(OR(N23=\"\",N23=0),0,-ROUND(N23/(1+L23)*L23,2))))","v":""},null,{"$f":"IF(Eingaben!F6=\"\",\"\",IF(ISERROR(IF(OR(N23=0,N23=\"\"),0,N23+P23)),0,IF(OR(N23=0,N23=\"\"),0,N23+P23)))","v":""},{"$nulls":6},{"$f":"+IF(Stammdaten!G30=\"\",\"\",Stammdaten!G30)","v":""}]
[{"$nulls":24},{"$f":"+IF(Stammdaten!G31=\"\",\"\",Stammdaten!G31)","v":""}]
[{"$nulls":3},"Fahrten mit Privat-PKW",{"$nulls":20},{"$f":"+IF(Stammdaten!G32=\"\",\"\",Stammdaten!G32)","v":""}]
[{"$nulls":24},{"$f":"+IF(Stammdaten!G33=\"\",\"\",Stammdaten!G33)","v":""}]
[{"$nulls":3},"Gefahrene km:",{"$nulls":5},{"$f":"+IF(Eingaben!J24=\"\",\"\",Eingaben!J24)","v":""},{"$nulls":3},{"$f":"IF(Eingaben!F6=\"\",\"\",IF(ISERROR(IF(J27=0,\"\",ROUND(J27*0.3,2))),0,IF(J27=0,\"\",ROUND(J27*0.3,2))))","v":""},null,{"$f":"IF(ISERROR(IF(AND($F$13<>\"Deutschland\",$Z$79=0),0,IF(N27=\"\",\"\",0))),0,IF(AND($F$13<>\"Deutschland\",$Z$79=0),0,IF(N27=\"\",\"\",0)))","v":""},null,{"$f":"+IF(N27=\"\",\"\",IF(OR(N27=0,N27=\"\"),0,N27+P27))","v":""},{"$nulls":6},{"$f":"+IF(Stammdaten!G34=\"\",\"\",Stammdaten!G34)","v":""}]
[]
[{"$nulls":3},"Unterbringung",{"$nulls":20},"Frühstück Deutschland",{"$f":"+IF(F13<>\"Deutschland\",\"\",IF(Eingaben!S3=1,Eingaben!T2,Eingaben!T3))","v":1.6},{"$f":"IF(ISERROR(Z29*J31),0,Z29*J31)","v":0}]
[]
{"$rows_left_out":53}
{"sheet":"Beispiel","index":3,"n_rows":79,"n_cols":22,"rows_kept":79,"merged":[[52,1,52,3],[52,6,52,8]]}
[{"$nulls":13},"Beispiel"]
[{"$nulls":19},1.57]
[{"$nulls":18},1,4.8]
[]
[{"$nulls":18},"Mitarbeiter",null,{"$f":"IF(ISERROR(VLOOKUP($F$4,Stammdaten!$C$13:$O$34,1,FALSE)&\", \"&VLOOKUP($F$4,Stammdaten!$C$13:$O$34,7,FALSE)&\", \"&VLOOKUP($F$4,Stammdaten!$C$13:$O$34,8,FALSE)&\" \"&VLOOKUP($F$4,Stammdaten!$C$13:$O$34,9,FALSE)),\"Fehler\",VLOOKUP($F$4,Stammdaten!$C$13:$O$34,1,FALSE)&\", \"&VLOOKUP($F$4,Stammdaten!$C$13:$O$34,7,FALSE)&\", \"&VLOOKUP($F$4,Stammdaten!$C$13:$O$34,8,FALSE)&\" \"&VLOOKUP($F$4,Stammdaten!$C$13:$O$34,9,FALSE))","v":"Fehler"}]
[{"$nulls":18},{"$f":"+IF(Stammdaten!G13=\"\",\"\",Stammdaten!G13)","v":"Mustermann, Max"}]
[{"$nulls":18},{"$f":"+IF(Stammdaten!G14=\"\",\"\",Stammdaten!G14)","v":"Müller, Hein-Otto"}]
[{"$nulls":18},{"$f":"+IF(Stammdaten!G15=\"\",\"\",Stammdaten!G15)","v":"Meier, Otti"}]
[{"$nulls":18},{"$f":"+IF(Stammdaten!G16=\"\",\"\",Stammdaten!G16)","v":""}]
[{"$nulls":18},{"$f":"+IF(Stammdaten!G17=\"\",\"\",Stammdaten!G17)","v":""}]
[{"$nulls":18},{"$f":"+IF(Stammdaten!G18=\"\",\"\",Stammdaten!G18)","v":""}]
[{"$nulls":18},{"$f":"+IF(Stammdaten!G19=\"\",\"\",Stammdaten!G19)","v":""}]
[{"$nulls":18},{"$f":"+IF(Stammdaten!G20=\"\",\"\",Stammdaten!G20)","v":""}]
[{"$nulls":18},{"$f":"+IF(Stammdaten!G21=\"\",\"\",Stammdaten!G21)","v":""}]
[{"$nulls":18},{"$f":"+IF(Stammdaten!G22=\"\",\"\",Stammdaten!G22)","v":""}]
[{"$nulls":18},{"$f":"+IF(Stammdaten!G23=\"\",\"\",Stammdaten!G23)","v":""}]
[{"$nulls":18},{"$f":"+IF(Stammdaten!G24=\"\",\"\",Stammdaten!G24)","v":""}]
[{"$nulls":18},{"$f":"+IF(Stammdaten!G25=\"\",\"\",Stammdaten!G25)","v":""}]
[{"$nulls":18},{"$f":"+IF(Stammdaten!G26=\"\",\"\",Stammdaten!G26)","v":""}]
[{"$nulls":18},{"$f":"+IF(Stammdaten!G27=\"\",\"\",Stammdaten!G27)","v":""}]
[{"$nulls":18},{"$f":"+IF(Stammdaten!G28=\"\",\"\",Stammdaten!G28)","v":""}]
[{"$nulls":18},{"$f":"+IF(Stammdaten!G29=\"\",\"\",Stammdaten!G29)","v":""}]
[{"$nulls":18},{"$f":"+IF(Stammdaten!G30=\"\",\"\",Stammdaten!G30)","v":""}]
[{"$nulls":18},{"$f":"+IF(Stammdaten!G31=\"\",\"\",Stammdaten!G31)","v":""}]
[{"$nulls":18},{"$f":"+IF(Stammdaten!G33=\"\",\"\",Stammdaten!G33)","v":""}]
[{"$nulls":18},{"$f":"+IF(Stammdaten!G34=\"\",\"\",Stammdaten!G34)","v":""}]
[]
[]
[{"$nulls":18},"Pauschale Deutschland",{"$f":"+IF(S3=1,T2,T3)","v":1.57},{"$f":"+IF(ISERROR(T29*J28),0,T29*J28)","v":0}]
[]
{"$rows_left_out":34}
{"sheet":"Hilfe","index":4,"n_rows":19,"n_cols":6,"rows_kept":19,"merged":[[2,1,2,5],[14,1,14,3]]}
[]
[{"$nulls":5},"Hilfe"]
[null,"Reisekostenrechner 2026 - Hilfe"]
[]
[{"$nulls":3},"Allgemeine Hinweise"]
[]
[]
[]
[{"$nulls":3},"Hinweise zum Reisekostenrechner"]
[]
[]
[]
[]
[]
[null,"<< Startseite"]
[]
[null,"© 2026 by mediaforwork - ein Unternehmensbereich der Verlag für die Deutsche Wirtschaft AG"]
[null,"Die Vervielfältigung, Verbreitung oder Veräußerung der Daten oder Texte ist unzulässig und"]
[null,"ausdrücklich nur mit Genehmigung des Verlags gestattet."]

{"sheet":"Stammdaten","index":5,"n_rows":41,"n_cols":25,"rows_kept":41,"merged":[[36,8,36,9]]}
[]
[{"$nulls":15},"Stammdaten"]
[null,"Reisekosten 2026 - Stammdaten",{"$nulls":15},"Reisekosten - Stammdaten",{"$nulls":6},2]
[]
[]
[{"$nulls":3},"Abzurechnende Mitarbeiter",{"$nulls":14},"Belegarten"]
[]
[{"$nulls":3},"Auswahl des Mitarbeiters druch",{"$nulls":14},"Nr.","Bezeichnung - Deutsch -","Bezeichnung - Englisch -","MwSt"]
[{"$nulls":18},1,"Mietwagen","Rental Car",{"v":0.19,"d":"19.00%"}]
[{"$nulls":18},{"$f":"+IF(T10=\"\",\"\",MAX($S$9:S9)+1)","v":2},"Bewirtungskosten","Entertainment",{"v":0.19,"d":"19.00%"}]
[{"$nulls":18},{"$f":"+IF(T11=\"\",\"\",MAX($S$9:S10)+1)","v":3},"öffentliche Verkehrsmittel","Public Transportation",{"v":0.19,"d":"19.00%"}]
[null,null,"Aus-\nwahl","Pers.-\nNr","Name","Vorname","Listeneintrag","KST","Straße","PLZ",null,"Bank","BLZ","Konto-Nr.","Sonstiges",{"$nulls":3},{"$f":"+IF(T12=\"\",\"\",MAX($S$9:S11)+1)","v":4},"Geschenke","Gifts",{"v":0.19,"d":"19.00%"}]
[null,null,{"$f":"+IF(G13=\"\",\"\",G13)","v":"Mustermann, Max"},1,"Mustermann","Max",{"$f":"IF(ISERROR(IF(OR(E13=\"\",F13=\"\"),\"\",IF($Y$3=2,E13&\", \"&F13,F13&\", \"&E13))),\"\",IF(OR(E13=\"\",F13=\"\"),\"\",IF($Y$3=2,E13&\", \"&F13,F13&\", \"&E13)))","v":"Mustermann, Max"},4711,"Musterstraße 11",47111,"Musterstadt","Musterbank","0047114711","124578963",{"$nulls":4},{"$f":"+IF(T13=\"\",\"\",MAX($S$9:S12)+1)","v":5},"Taxi 7%","Taxi",{"v":0.07,"d":"7.00%"}]
[null,null,"Müller, Hein-Otto",2,"Müller","Hein-Otto",{"$f":"IF(ISERROR(IF(OR(E14=\"\",F14=\"\"),\"\",IF($Y$3=2,E14&\", \"&F14,F14&\", \"&E14))),\"\",IF(OR(E14=\"\",F14=\"\"),\"\",IF($Y$3=2,E14&\", \"&F14,F14&\", \"&E14)))","v":"Müller, Hein-Otto"},4712,"Berliner Platz 11",47111,"Musterstadt","Musterbank","123465678","1254896",{"$nulls":4},{"$f":"+IF(T14=\"\",\"\",MAX($S$9:S13)+1)","v":6},"Taxi 19%","Taxi",{"v":0.19,"d":"19.00%"}]
[null,null,"Meier, Otti",3,"Meier","Otti","Meier, Otti",4713,"Steinstraße 11",47111,"Musterstadt","Musterbank","987654","0006659985",{"$nulls":4},{"$f":"+IF(T15=\"\",\"\",MAX($S$9:S14)+1)","v":7},"Kfz: Parkgebühren","Automobile: Parking Fee",{"v":0.19,"d":"19.00%"}]
[null,null,"",{"$nulls":3},"",{"$nulls":11},{"$f":"+IF(T16=\"\",\"\",MAX($S$9:S15)+1)","v":8},"Telefon / Handy","Telephone / Mobile Phone",{"v":0.19,"d":"19.00%"}]
[null,null,"",{"$nulls":3},"",{"$nulls":11},{"$f":"+IF(T17=\"\",\"\",MAX($S$9:S16)+1)","v":9},"Kfz: sonstige Kosten","Automobile: Other Expenses",{"v":0.19,"d":"19.00%"}]
[null,null,"",{"$nulls":3},"",{"$nulls":11},{"$f":"+IF(T18=\"\",\"\",MAX($S$9:S17)+1)","v":10},"Kfz: Treibstoff","Automobile: Petrol",{"v":0.19,"d":"19.00%"}]
[null,null,"",{"$nulls":3},""]
[null,null,"",{"$nulls":3},""]
[null,null,"",{"$nulls":3},""]
[null,null,"",{"$nulls":3},"",{"$nulls":11},{"$f":"+IF(T22=\"\",\"\",MAX($S$9:S21)+1)","v":""}]
[null,null,"",{"$nulls":3},"",{"$nulls":11},{"$f":"+IF(T23=\"\",\"\",MAX($S$9:S22)+1)","v":""}]
[null,null,"",{"$nulls":3},"",{"$nulls":11},{"$f":"+IF(T24=\"\",\"\",MAX($S$9:S23)+1)","v":""}]
[null,null,"",{"$nulls":3},"",{"$nulls":11},{"$f":"+IF(T25=\"\",\"\",MAX($S$9:S24)+1)","v":""}]
[null,null,"",{"$nulls":3},"",{"$nulls":11},{"$f":"+IF(T26=\"\",\"\",MAX($S$9:S25)+1)","v":""}]
[null,null,"",{"$nulls":3},"",{"$nulls":11},{"$f":"+IF(T27=\"\",\"\",MAX($S$9:S26)+1)","v":""}]
[null,null,"",{"$nulls":3},"",{"$nulls":11},{"$f":"+IF(T28=\"\",\"\",MAX($S$9:S27)+1)","v":""}]
[null,null,"",{"$nulls":3},"",{"$nulls":11},{"$f":"+IF(T29=\"\",\"\",MAX($S$9:S28)+1)","v":""}]
[null,null,"",{"$nulls":3},"",{"$nulls":11},{"$f":"+IF(T30=\"\",\"\",MAX($S$9:S29)+1)","v":""}]
{"$rows_left_out":12}
{"sheet":"Pauschalen","index":6,"n_rows":228,"n_cols":15,"rows_kept":228,"merged":[[3,4,3,12],[223,5,223,6]]}
[]
[null,null,"Pauschalen - Komplette Liste",{"$nulls":10},"Pauschalen"]
[]
[{"$nulls":4},"Pauschalen 2026"]
[{"$nulls":4},"Nr","Land","Land Englisch","8 - 14 Std.","Mehr als 8 Stunden","ganzer Tag","Abzug bei Frühstück","Leer","ÜP",null,"Nr"]
[{"$nulls":4},1,"Deutschland",null,null,{"v":14,"d":"14.00"},{"v":28,"d":"28.00"},{"v":-6,"d":"-6.00"},{"v":0,"d":"0.00"},{"v":20,"d":"20.00"},null,{"$f":"+E6","v":1}]
[{"$nulls":4},2,"Ägypten",null,null,{"v":33,"d":"33.00"},{"v":50,"d":"50.00"},{"v":-6,"d":"-6.00"},{"v":0,"d":"0.00"},{"v":112,"d":"112.00"}]
[{"$nulls":4},3,"Äthiopien",null,null,{"v":29,"d":"29.00"},{"v":44,"d":"44.00"},null,null,{"v":159,"d":"159.00"},null,{"$f":"+E8","v":3}]
[{"$nulls":4},4,"Äquatorialguinea",null,null,{"v":28,"d":"28.00"},{"v":42,"d":"42.00"},null,null,{"v":166,"d":"166.00"},null,4]
[{"$nulls":4},5,"Albanien",null,null,{"v":22,"d":"22.00"},{"v":33,"d":"33.00"},null,null,{"v":116,"d":"116.00"}]
[{"$nulls":4},6,"Algerien",null,null,{"v":32,"d":"32.00"},{"v":47,"d":"47.00"},null,null,{"v":120,"d":"120.00"}]
[{"$nulls":4},7,"Andorra",null,null,{"v":30,"d":"30.00"},{"v":45,"d":"45.00"},null,null,{"v":135,"d":"135.00"},null,7]
[{"$nulls":4},8,"Angola",null,null,{"v":27,"d":"27.00"},{"v":40,"d":"40.00"},null,null,{"v":368,"d":"368.00"}]
[{"$nulls":4},9,"Argentinien",null,null,{"v":28,"d":"28.00"},{"v":42,"d":"42.00"},null,null,{"v":119,"d":"119.00"},null,9]
[{"$nulls":4},10,"Armenien",null,null,{"v":20,"d":"20.00"},{"v":29,"d":"29.00"},null,null,{"v":107,"d":"107.00"},null,10]
[{"$nulls":4},11,"Aserbaidschan",null,null,{"v":29,"d":"29.00"},{"v":44,"d":"44.00"},null,null,{"v":88,"d":"88.00"},null,11]
[{"$nulls":4},12,"Australien – Canberra",null,null,{"v":49,"d":"49.00"},{"v":74,"d":"74.00"},null,null,{"v":186,"d":"186.00"},null,12]
[{"$nulls":4},13,"Australien –  Sydney",null,null,{"v":38,"d":"38.00"},{"v":57,"d":"57.00"},null,null,{"v":173,"d":"173.00"},null,13]
[{"$nulls":4},14,"Australien – im Übrigen",null,null,{"v":38,"d":"38.00"},{"v":57,"d":"57.00"},null,null,{"v":173,"d":"173.00"},null,14]
[{"$nulls":4},15,"Bahrain",null,null,{"v":32,"d":"32.00"},{"v":48,"d":"48.00"},null,null,{"v":153,"d":"153.00"},null,15]
[{"$nulls":4},16,"Bangladesch",null,null,{"v":31,"d":"31.00"},{"v":46,"d":"46.00"},null,null,{"v":189,"d":"189.00"},null,16]
[{"$nulls":4},17,"Barbados",null,null,{"v":36,"d":"36.00"},{"v":54,"d":"54.00"},null,null,{"v":206,"d":"206.00"},null,17]
[{"$nulls":4},18,"Belgien",null,null,{"v":40,"d":"40.00"},{"v":59,"d":"59.00"},null,null,{"v":141,"d":"141.00"},null,18]
[{"$nulls":4},19,"Benin",null,null,{"v":27,"d":"27.00"},{"v":40,"d":"40.00"},null,null,{"v":168,"d":"168.00"},null,19]
[{"$nulls":4},20,"Bhutan",null,null,{"v":18,"d":"18.00"},{"v":27,"d":"27.00"},null,null,{"v":176,"d":"176.00"},null,20]
[{"$nulls":4},21,"Bolivien",null,null,{"v":31,"d":"31.00"},{"v":46,"d":"46.00"},null,null,{"v":108,"d":"108.00"},null,21]
[{"$nulls":4},22,"Bosnien und Herzegowina",null,null,{"v":21,"d":"21.00"},{"v":32,"d":"32.00"},null,null,{"v":109,"d":"109.00"},null,22]
[{"$nulls":4},23,"Botsuana",null,null,{"v":27,"d":"27.00"},{"v":40,"d":"40.00"},null,null,{"v":105,"d":"105.00"},null,23]
[{"$nulls":4},24,"Brasilien –  Brasilia",null,null,{"v":34,"d":"34.00"},{"v":51,"d":"51.00"},null,null,{"v":88,"d":"88.00"},null,24]
[{"$nulls":4},25,"Brasilien – Rio de Janeiro",null,null,{"v":46,"d":"46.00"},{"v":69,"d":"69.00"},null,null,{"v":140,"d":"140.00"},null,25]
{"$rows_left_out":199}
{"sheet":"Parameter_Intern","index":7,"n_rows":10,"n_cols":5,"rows_kept":10,"hidden":true}
[]
[]
[]
[null,"Nr","Tabellenblatt","Hinweise","Hyperlink"]
[null,1,"Eingaben","Hier geben Sie die Daten zur Erstellung der Reisekostenabrechnung ein","#Eingaben!E2"]
[null,2,"Berechnung","In diesem Arbeitsblatt wird die Reisekostenabrechnung erstellt","#Berechnung!B2"]
[null,3,"Beispiel","Hier finden Sie ein Beispiel für die Eingaben","#Beispiel!B2"]
[null,4,"Hilfe","Hier finden Sie nähere Informationen über die Anwendung.","#Hilfe!B3"]
[null,5,"Stammdaten","In diesem Arbeitsblatt pflegen Sie Mitarbeiter und Belegarten","#Stammdaten!D12"]
[null,6,"Pauschalen","Hier können Sie die Reisekostenpauschalen einpflegen","#Pauschalen!c2"]

{"sheet":"__Goal_Metadata","index":8,"n_rows":2,"n_cols":2,"rows_kept":2,"hidden":true}
["_KAW999934","J"]
["_KAW999929","e97c26fe-fa5a-4769-94df-cc203eff761b"]